{"text_format":"1","workbook":"xlsx","n_sheets":19,"sheets":["INSTRUCTIONS","WORK SHEET","P. TOKEN","ANNEX-I & II","101","PROCEEDINGS","47-FRONT","BILL-NOTIONAL","BILL-P.F & CASH","BILL","47-BUDGET","P.F SCHEDULE","PT SCHEDULE","49-(1P)","49-(2P)","PREAMBLE","Sheet1","Sheet2","Sheet3"],"not_rendered":{"charts":0,"images":4,"macros":1,"external_links":2,"defined_names":1,"comments":1,"pivot_tables":0},"unopened":[],"bounds":{"document_bytes":16777216,"sheet_cells":100000,"rows_first":2000,"rows_last":500,"rows_between":2000,"halvings":0,"cell_chars":16384,"cell_head_chars":4096},"cells_cut":0,"cells_raw":0,"read":"whole","date_system":"1900"}

{"sheet":"INSTRUCTIONS","index":0,"n_rows":43,"n_cols":10,"rows_kept":43,"cut":false,"hidden":false,"merged":[[1,0,1,14],[31,1,32,14],[0,0,0,14],[4,0,4,13],[40,2,40,10],[39,2,39,10],[27,1,27,14],[38,1,38,14],[42,1,42,13],[3,0,3,14],[28,1,29,14],[28,0,29,0],[33,1,34,14],[36,1,37,14],[30,1,30,14],[35,1,35,14],[24,1,24,6],[25,9,25,15],[24,9,24,15],[14,5,14,11],[41,2,41,10]]}
[]
["INSTRUCTIONS TO USE THE AUTOMATIC ADVANCEMENT SCHEME (AAS) SOFTWARE"]
[]
["THIS IS A FREE SOFTWARE PREPARED FOR THE BENEFIT OF A.P. UNITED TEACHERS FEDERATION "]
["MEMBERS OF UTF PRAKASAM"]
[]
{"$rows_left_out":38}
{"sheet":"WORK SHEET","index":1,"n_rows":965,"n_cols":126,"rows_kept":965,"cut":false,"hidden":false,"merged":[[43,4,43,6],[44,4,44,6],[34,4,34,6],[35,4,35,6],[36,4,36,6],[38,4,38,6],[39,4,39,6],[31,4,31,6],[32,4,32,6],[33,4,33,6],[40,4,40,6],[41,4,41,6],[24,4,24,6],[25,4,25,6],[26,4,26,6],[29,4,29,6],[30,4,30,6],[19,4,19,6],[20,4,20,6],[21,4,21,6],[22,4,22,6],[23,4,23,6],[13,4,13,6],[14,4,14,6],[15,4,15,6],[17,4,17,6],[18,4,18,6],[8,4,8,6],[9,4,9,6],[10,4,10,6],[11,4,11,6],[12,4,12,6],[3,4,3,6],[4,4,4,6],[5,4,5,6],[6,4,6,6],[7,4,7,6],[41,1,44,1],[1,7,6,9],[99,14,99,15],[100,14,100,15],[98,14,98,15],[40,1,40,2],[16,4,16,6],[35,1,35,2],[36,1,36,2],[38,1,38,2],[31,1,31,2],[32,1,32,2],[34,1,34,2],[42,7,45,8],[1,4,1,6],[2,4,2,6],[101,14,101,15],[1,1,1,2],[2,1,2,2],[3,1,3,2],[4,1,4,2],[16,1,16,2],[8,1,8,2],[33,1,33,2],[28,1,28,2],[24,1,24,2],[25,1,25,2],[29,1,29,2],[20,1,20,2],[21,1,21,2],[22,1,22,2],[27,1,27,2],[0,0,0,6],[13,0,23,0],[1,0,11,0],[9,1,9,2],[10,1,10,2],[11,1,11,2],[12,1,12,2],[5,1,5,2],[6,1,6,2],[7,1,7,2],[17,1,17,2],[18,1,18,2],[19,1,19,2],[13,1,13,2],[14,1,14,2],[15,1,15,2]]}
["WORK SHEET"]
["Individual Data","NAME OF THE TEACHER",null,":","SK.KHAJARAHAMTULLA",null,null,"PLEASE READ THE INSTRECTIONS CAREFULLY BEFORE FILL THE WORK SHEET"]
[null,"SCHOOL ",null,":","MPPS(G)"]
[null,"VILLAGE / TOWN",null,":","POTLAPADU"]
[null,"MANDAL",null,":","KURICHEDU"]
[null,"DISTRICT",null,":","PRAKASAM"]
{"$rows_left_out":960}
{"sheet":"P. TOKEN","index":2,"n_rows":33,"n_cols":15,"rows_kept":33,"cut":false,"hidden":false,"merged":[[0,0,0,14],[1,0,1,14],[4,9,4,14],[6,1,6,4],[6,11,6,14],[8,1,8,4],[8,10,8,14],[16,12,17,12],[13,1,13,4],[13,6,13,7],[13,9,13,11],[13,13,13,14],[15,1,15,2],[15,6,15,8],[15,11,15,13],[16,1,17,2],[16,3,16,4],[16,5,17,5],[16,6,16,10],[16,11,17,11],[19,3,19,5],[19,6,19,8],[22,1,22,6],[19,12,19,14],[19,9,19,11],[33,12,33,13],[5,1,5,4],[10,8,10,14],[25,0,25,3],[30,4,30,6],[30,11,30,14],[31,0,32,0],[32,12,32,13],[21,1,21,14],[16,13,17,13],[22,10,22,14],[23,0,23,3],[16,14,17,14],[17,3,17,4],[17,6,17,10],[19,1,19,2]]}
["A.P. STATE GOVERNMENT"]
["PAPER TOKEN"]
[]
[]
["STO Code:",{"$f":"'47-FRONT'!F7","v":0},{"$f":"'47-FRONT'!G7","v":7},{"$f":"'47-FRONT'!H7","v":0},{"$f":"'47-FRONT'!I7","v":5},null,null,null,null,"(For Treasury Use Only)"]
["STO Name:",{"$f":"'WORK SHEET'!E18","v":"STO;DARSI"},null,null,null,null,null,null,null,"Date:……………………"]
{"$rows_left_out":28}
{"sheet":"ANNEX-I & II","index":3,"n_rows":17,"n_cols":16,"rows_kept":17,"cut":false,"hidden":false,"merged":[[5,2,5,4],[4,10,4,11],[7,9,7,11],[7,2,7,4],[8,9,8,11],[5,10,5,11],[0,0,0,6],[1,0,1,6],[2,0,2,6],[4,2,4,3],[3,2,3,4],[18,0,18,15],[16,8,16,9],[16,14,16,15],[12,9,12,11],[12,12,12,14],[14,8,14,15],[13,8,13,15],[0,8,0,15],[1,8,1,15],[2,8,2,15],[3,10,3,12],[11,9,11,11],[4,12,4,13],[10,9,10,11],[9,9,9,11],[8,12,11,14],[7,12,7,14],[9,2,9,4],[14,0,14,2],[8,2,8,3],[15,0,15,2],[10,0,10,6],[14,5,14,6],[15,5,15,6],[11,0,11,6]]}
["ANNEXURE - I",null,null,null,null,null,null,null,"ANNEXURE - II"]
["(Employ wise details)",null,null,null,null,null,null,null,"(Notified Link Bank Report)"]
["To be furnished by the DDO in triplicate along with the bill",null,null,null,null,null,null,null,"To be furnished by the DDO in triplicate"]
["Name of the NPB:      S.B.I.       ADDANKI",null,{"$f":"'P. TOKEN'!I11","v":"SYNDICATE BANK DARSI"},null,null,null,null,null,"DDO Code              :",null,{"$f":"C5","v":"07050308026"}]
["DDO CODE        :                        ",null,{"$f":"'P. TOKEN'!B7","v":"07050308026"},null,null,"              Date  :",null,null,"DDO Name & Desig:                  ",null,{"$f":"'WORK SHEET'!E16","v":"N.vijayakumar"},null,{"$f":"'ANNEX-I & II'!C6","v":"M.E.O."},null,"Date"]
["DDO  Desig        :                        ",null,{"$f":"'P. TOKEN'!B9","v":"M.E.O."},null,null,"Trance ID No :",null,null,"Name of NLB          : ",null,{"$f":"'WORK SHEET'!E18","v":"STO;DARSI"},null,null,null,"Trans ID No:"]
{"$rows_left_out":12}
{"sheet":"101","index":4,"n_rows":29,"n_cols":16,"rows_kept":29,"cut":false,"hidden":false,"merged":[[13,13,13,15],[0,0,0,15],[1,0,1,15],[2,0,2,15],[5,3,5,8],[30,0,30,3],[7,12,7,15],[11,3,11,9],[16,0,16,15],[19,10,19,15],[22,0,22,3],[27,0,27,3],[27,10,27,15],[7,3,7,8],[13,5,13,6],[28,10,28,15],[29,0,29,3],[14,0,14,15],[15,11,15,15],[15,1,15,7],[13,9,13,10]]}
["A.P.T.C. FORM-101"]
["(See Subsidiary Rule2(w) Under Treasury Rule 15"]
["Govt.Memo No.38907/Accounts/ 65-5,Dt.21-02-1963)"]
[]
[]
["DDO CODE:",null,null,{"$f":"'P. TOKEN'!B7","v":"07050308026"},null,null,null,null,null,null,"Treasury / PAO Code:",null,{"$f":"'P. TOKEN'!B5","v":0},{"$f":"'P. TOKEN'!C5","v":7},{"$f":"'P. TOKEN'!D5","v":0},{"$f":"'P. TOKEN'!E5","v":5}]
{"$rows_left_out":24}
{"sheet":"PROCEEDINGS","index":5,"n_rows":43,"n_cols":10,"rows_kept":43,"cut":false,"hidden":false,"merged":[[37,1,37,9],[24,1,27,1],[17,6,17,9],[18,6,18,9],[19,6,19,9],[20,6,20,9],[21,6,21,9],[22,6,22,9],[30,2,30,5],[31,7,31,9],[20,2,20,4],[17,2,17,4],[18,2,18,4],[36,1,36,9],[6,3,6,8],[31,5,31,6],[31,1,31,2],[33,5,33,6],[34,5,34,6],[32,5,32,6],[5,3,5,8],[16,1,16,8],[35,2,35,5],[35,6,35,9],[0,1,0,9],[1,1,1,9],[28,6,28,9],[29,6,29,9],[30,6,30,9],[15,1,15,9],[32,7,32,9],[33,7,33,9],[34,7,34,9],[32,1,32,2],[33,1,33,2],[34,1,34,2]]}
[null,{"$f":"CONCATENATE(\"PROCEEDINGS OF THE \",IF('WORK SHEET'!E123=1,\"DEPUTY EDUCATIONAL OFFICER, \",VLOOKUP('WORK SHEET'!E124,'WORK SHEET'!AS52:BB55,9,TRUE)),\" \",IF('WORK SHEET'!E123=1,CONCATENATE('WORK SHEET'!E24,\" DIVISION\"),VLOOKUP('WORK SHEET'!E124,'WORK SHEET'!AS52:BB55,10,TRUE)))","v":"PROCEEDINGS OF THE MANDAL EDUCATIONAL OFFICER KURICHEDU"}]
[null,{"$f":"CONCATENATE(\"PRESENT :- \",'WORK SHEET'!E16)","v":"PRESENT :- N.vijayakumar"}]
[]
[null,"Rc.No.",{"$f":"'WORK SHEET'!E14","v":"2/AAS/2011"},null,null,null,null,"DATED :",{"$f":"'WORK SHEET'!E15","v":"2011-08-01"}]
[]
[null,null,"SUB:- ",{"$f":"CONCATENATE(\"Estt-\",IF(H40=\"DEPUTY EDUCATIONAL OFFICER.\",\"APES -\",\"APSESS -\"),'47-FRONT'!H26,\" - \",H41,\" - \",H42)","v":"Estt-APSESS -Elementry Education - MANDAL PARASAD  - KURICHEDU"}]
{"$rows_left_out":38}
{"sheet":"47-FRONT","index":6,"n_rows":70,"n_cols":24,"rows_kept":70,"cut":false,"hidden":false,"merged":[[60,1,60,23],[63,1,63,23],[64,0,68,0],[54,7,54,11],[55,7,55,11],[56,7,56,11],[58,1,59,11],[21,0,63,0],[52,7,52,11],[52,19,52,23],[49,7,49,11],[49,19,49,23],[53,7,53,11],[53,19,53,23],[50,7,50,11],[50,19,50,23],[51,7,51,11],[51,19,51,23],[46,7,46,11],[46,19,46,23],[47,7,47,11],[47,19,47,23],[48,7,48,11],[48,19,48,23],[43,7,43,11],[43,19,43,23],[44,7,44,11],[44,19,44,23],[45,7,45,11],[45,19,45,23],[39,19,39,23],[40,19,40,23],[41,7,41,11],[41,19,41,23],[42,7,42,11],[42,19,42,23],[38,19,38,23],[23,19,23,23],[25,19,25,23],[27,7,27,11],[27,19,27,23],[29,19,29,23],[31,7,31,11],[31,19,31,23],[33,19,33,23],[34,19,34,23],[35,19,35,23],[36,19,36,23],[37,19,37,23],[14,13,14,16],[16,9,16,11],[14,17,14,23],[9,1,9,4],[11,12,11,16],[11,17,11,23],[9,20,9,23],[11,5,11,11],[6,1,6,4],[6,17,6,18],[6,20,6,23],[0,1,0,21],[2,1,2,23],[1,1,1,23],[3,17,3,23],[4,1,4,4]]}
[null,{"$f":"CONCATENATE(\"AAS ARREAR BILLOF\",\"  \",'WORK SHEET'!E3,\", \",'WORK SHEET'!E4,\", \",'WORK SHEET'!E5)","v":"AAS ARREAR BILLOF  MPPS(G), POTLAPADU, KURICHEDU"},null,null,null,null,null,null,null,null,null,null,null,null,null,null,null,null,null,null,null,null,null,{"$f":"'WORK SHEET'!E62","v":"2009-08-06"}]
[null,{"$f":"CONCATENATE(\"Payable At Sub-Treasury Office - \",'WORK SHEET'!E18)","v":"Payable At Sub-Treasury Office - STO;DARSI"}]
[null,"  GOVERNMENT OF ANDHRA PRADESH                                                                                                                                                         ( A.P.T.C.Form - 47 )                     \n"]
[null,null,null,null,null,null,null,null,null,null,null,null,null,null,null,null,null,"(For Treasury Use Only)"]
[null,"Pay Bill for the Month & Year",null,null,null,{"$f":"IF(MONTH(X1)<=9,0,1)","v":0},{"$f":"IF(MONTH(X1)>9,MONTH(X1)-10,MONTH(X1))","v":8},null,2,0,1,0,null,null,null,null,null,"DATE:  _____________"]
[]
{"$rows_left_out":65}
{"sheet":"BILL-NOTIONAL","index":7,"n_rows":63,"n_cols":22,"rows_kept":63,"cut":false,"hidden":true,"merged":[[5,2,5,9],[0,20,0,21],[0,0,0,19],[41,5,41,6],[10,5,10,6],[26,5,26,6],[32,2,32,9],[41,7,41,8],[37,7,37,8],[30,7,30,8],[26,7,26,8],[30,5,30,6],[37,5,37,6],[10,1,10,2],[14,1,14,2],[18,7,18,8],[22,5,22,6],[18,1,18,2],[45,1,45,2],[22,1,22,2],[49,1,49,2],[57,1,57,2],[26,1,26,2],[30,1,30,2],[37,1,37,2],[53,1,53,2],[41,1,41,2],[61,7,61,8],[57,7,57,8],[53,7,53,8],[57,5,57,6],[61,5,61,6],[62,1,62,2],[62,5,62,6],[62,7,62,8],[2,2,2,9],[3,2,3,9],[45,5,45,6],[14,5,14,6],[18,5,18,6],[49,5,49,6],[53,5,53,6],[45,7,45,8],[49,7,49,8],[61,1,61,2],[10,7,10,8],[14,7,14,8],[22,7,22,8]]}
[{"$f":"CONCATENATE(\"PRC-08 ARREAR OF\",\" \",'WORK SHEET'!E2,\" ,\",'WORK SHEET'!E54,\", \",'WORK SHEET'!E3,\", \",'WORK SHEET'!E4,\", \",'WORK SHEET'!E5,\", MANDAL\",\" FROM 01-07-2008 To\")","v":"PRC-08 ARREAR OF SK.KHAJARAHAMTULLA ,, MPPS(G), POTLAPADU, KURICHEDU, MANDAL FROM 01-07-2008 To"},null,null,null,null,null,null,null,null,null,null,null,null,null,null,null,null,null,null,null,{"$f":"'BILL-P.F & CASH'!P17","v":"2011-07-30T00:14:24"}]
[]
[null,"Sl.No","Name and Designation",null,null,null,null,null,null,null,"Pay","D.A","H.R.A","I.R",{"$f":"G7","v":0},{"$f":"H7","v":0},{"$f":"I7","v":0},"Grand Total","GPF","Z.P.P.F","Govt Deductions","Net "]
[null,1,2,null,null,null,null,null,null,null,3,4,5,6,7,8,9,10,11,12,13,14]
[{"$f":"'WORK SHEET'!E7","v":724731},1,{"$f":"'WORK SHEET'!E2","v":"SK.KHAJARAHAMTULLA"},null,null,null,null,null,{"$f":"'WORK SHEET'!E54","v":0},null,"PART - I ( NOTIONAL FROM 01-07-2008 to 31-01-2010 = 19 MONTHS )"]
[null,null,{"$f":"PROCEEDINGS!#REF!","v":{"$error":"#REF!"}}]
{"$rows_left_out":58}
{"sheet":"BILL-P.F & CASH","index":8,"n_rows":41,"n_cols":22,"rows_kept":41,"cut":false,"hidden":true,"merged":[[29,7,29,8],[40,0,40,21],[30,1,30,2],[35,2,35,9],[33,0,33,21],[31,0,31,21],[34,2,34,9],[39,2,39,9],[36,2,36,9],[37,2,37,9],[38,2,38,9],[30,5,30,6],[30,7,30,8],[29,1,29,2],[29,5,29,6],[21,1,21,2],[21,5,21,6],[21,7,21,8],[25,1,25,2],[25,5,25,6],[25,7,25,8],[0,20,0,21],[1,2,1,9],[2,2,2,9],[5,2,5,9],[10,1,10,2],[10,5,10,6],[10,7,10,8],[16,17,16,18],[16,10,16,13],[16,15,16,16],[15,5,15,6],[0,0,0,19],[14,1,14,2],[14,5,14,6],[14,7,14,8]]}
[{"$f":"CONCATENATE(\"PRC-10 ARREAR OF \",'WORK SHEET'!E2,\", \",'WORK SHEET'!E54,\", \",'WORK SHEET'!E3,\", \",'WORK SHEET'!E4,\", \",'WORK SHEET'!E5,\" MANDAL\",\" FROM 01-07-2008 To\")","v":"PRC-10 ARREAR OF SK.KHAJARAHAMTULLA, , MPPS(G), POTLAPADU, KURICHEDU MANDAL FROM 01-07-2008 To"},null,null,null,null,null,null,null,null,null,null,null,null,null,null,null,null,null,null,null,{"$f":"P17","v":"2011-07-30T00:14:24"}]
[null,"Sl.No","Name and Designation",null,null,null,null,null,null,null,"Pay","D.A","H.R.A","I.R",{"$f":"IF('WORK SHEET'!D94=0,\" \",'WORK SHEET'!E94)","v":" "},{"$f":"IF('WORK SHEET'!D95=0,\" \",'WORK SHEET'!E95)","v":" "},null,"Grand Total","G.P.F.","Z.P.P.F","Govt Deductions","Net "]
[null,1,2,null,null,null,null,null,null,null,3,4,5,6,7,8,9,10,11,12,13,14]
[null,null,null,null,null,null,null,null,null,null,"PART -II ( Credited to P.F. from 01-02-2010 to 28-02-2010 ( 1 Month)"]
[{"$f":"'BILL-NOTIONAL'!A5","v":724731},1,{"$f":"'WORK SHEET'!E2","v":"SK.KHAJARAHAMTULLA"},null,null,null,null,null,{"$f":"'WORK SHEET'!E54","v":0}]
[null,null,{"$f":"'BILL-NOTIONAL'!C6:J6","v":{"$error":"#REF!"}}]
{"$rows_left_out":36}
{"sheet":"BILL","index":9,"n_rows":42,"n_cols":34,"rows_kept":42,"cut":false,"hidden":false,"merged":[[38,1,38,25],[0,1,0,33],[28,3,28,20],[1,3,1,33],[2,3,2,4],[2,6,2,15],[2,16,2,25],[2,26,2,33],[2,5,3,5],[37,1,37,25]]}
[null,{"$f":"CONCATENATE(\"Claim for pay fixcation arrear in the Automatec Advacement Sceme of \",'WORK SHEET'!E2,\" \",PROCEEDINGS!G19,\" \",'WORK SHEET'!E3,\" \",'WORK SHEET'!E4)","v":"Claim for pay fixcation arrear in the Automatec Advacement Sceme of SK.KHAJARAHAMTULLA S.G.T. MPPS(G) POTLAPADU"}]
[]
[null,null,null,"Period",null,"Days","Eligible",null,null,null,null,null,null,null,null,null,"Already drawn",null,null,null,null,null,null,null,null,null,"Difference"]
[null,"D.A.%","H.R.A%","From","To",null,"B Pay","P.P.","F.P","D A","HRA",null,null,"P.T",{"$f":"IF('WORK SHEET'!D96=0,0,'WORK SHEET'!E96)","v":0},"Total","B Pay","P.P.","F.P.","D A","HRA",null,null,"P.T",{"$f":"O4","v":0},"Total","B Pay","D A","HRA",{"$f":"V4","v":0},null,{"$f":"X4","v":"P.T"},{"$f":"Y4","v":0},"Total"]
[null,{"$f":"'WORK SHEET'!H277","v":16.263999999999999},{"$f":"'WORK SHEET'!J277","v":10},{"$f":"'WORK SHEET'!C277","v":"2010-02-01"},{"$f":"'WORK SHEET'!E277","v":"2010-02-28"},{"$f":"'WORK SHEET'!D277","v":28},{"$f":"'WORK SHEET'!O277","v":14860},{"$f":"'WORK SHEET'!T277","v":0},{"$f":"'WORK SHEET'!U277","v":0},{"$f":"'WORK SHEET'!R277","v":2417},{"$f":"'WORK SHEET'!S277","v":1486},null,null,{"$f":"IF(P5=0,0,IF(P5<=6000,60,IF(P5<=10000,80,IF(P5<=15000,100,IF(P5<=20000,150,200)))))","v":150},null,{"$f":"IF(OR(D5=0,DAY(D5)<>1),0,IF(DAY(D6)<>1,SUM(G5:M5)+SUM(G6:M6),SUM(G5:M5)))","v":18763},{"$f":"'WORK SHEET'!N277","v":14440},{"$f":"H5","v":0},0,{"$f":"'WORK SHEET'!P277","v":2349},{"$f":"'WORK SHEET'!Q277","v":1444},null,null,{"$f":"IF(Z5=0,0,IF(Z5<=6000,60,IF(Z5<=10000,80,IF(Z5<=15000,100,IF(Z5<=20000,150,200)))))","v":150},null,{"$f":"IF(OR(D5=0,DAY(D5)<>1),0,IF(DAY(D6)<>1,SUM(Q5:W5)+SUM(Q6:W6),SUM(Q5:W5)))","v":18233},{"$f":"G5-Q5","v":420},{"$f":"J5-T5","v":68},{"$f":"K5-U5","v":42},{"$f":"L5-V5","v":0},null,{"$f":"N5-X5","v":0},{"$f":"O5-Y5","v":0},{"$f":"P5-Z5","v":530}]
[null,{"$f":"'WORK SHEET'!H278","v":16.263999999999999},{"$f":"'WORK SHEET'!J278","v":10},{"$f":"'WORK SHEET'!C278","v":"2010-03-01"},{"$f":"'WORK SHEET'!E278","v":"2010-03-31"},{"$f":"'WORK SHEET'!D278","v":31},{"$f":"'WORK SHEET'!O278","v":14860},{"$f":"'WORK SHEET'!T278","v":0},{"$f":"'WORK SHEET'!U278","v":0},{"$f":"'WORK SHEET'!R278","v":2417},{"$f":"'WORK SHEET'!S278","v":1486},null,null,{"$f":"IF(P6=0,0,IF(P6<=6000,60,IF(P6<=10000,80,IF(P6<=15000,100,IF(P6<=20000,150,200)))))","v":150},null,{"$f":"IF(OR(D6=0,DAY(D6)<>1),0,IF(DAY(D7)<>1,SUM(G6:M6)+SUM(G7:M7),SUM(G6:M6)))","v":18763},{"$f":"'WORK SHEET'!N278","v":14440},0,0,{"$f":"'WORK SHEET'!P278","v":2349},{"$f":"'WORK SHEET'!Q278","v":1444},null,null,{"$f":"IF(Z6=0,0,IF(Z6<=6000,60,IF(Z6<=10000,80,IF(Z6<=15000,100,IF(Z6<=20000,150,200)))))","v":150},null,{"$f":"IF(OR(D6=0,DAY(D6)<>1),0,IF(DAY(D7)<>1,SUM(Q6:W6)+SUM(Q7:W7),SUM(Q6:W6)))","v":18233},420,68,42,0,null,0,0,530]
{"$rows_left_out":37}
{"sheet":"47-BUDGET","index":10,"n_rows":38,"n_cols":11,"rows_kept":38,"cut":false,"hidden":false,"merged":[[35,8,35,13],[37,1,37,13],[27,2,27,13],[29,2,29,13],[30,7,30,8],[31,2,31,13],[28,2,28,5],[25,2,25,13],[0,1,0,13],[8,10,8,13],[11,2,11,13],[10,5,10,7],[17,10,17,13],[18,1,18,13],[20,2,20,13],[21,2,21,13],[22,2,22,13],[23,2,23,13],[24,2,24,13]]}
[null,"BUDGET"]
[]
[null,"1.","Budget allocation for the year 2010-2011",null,null,null,null,null,null,"Rs."]
[null,"2.","Total Expenditure including this Bill",null,null,null,null,null,null,"Rs."]
[null,"3.","Balance",null,null,null,null,null,null,"Rs."]
[]
{"$rows_left_out":33}
{"sheet":"P.F SCHEDULE","index":11,"n_rows":33,"n_cols":10,"rows_kept":33,"cut":false,"hidden":false,"merged":[[4,0,4,9],[9,1,9,3],[6,4,7,4],[5,5,5,7],[5,2,5,4],[32,7,32,9],[23,0,23,9],[25,0,26,0],[25,1,26,1],[25,2,26,3],[30,0,30,9],[25,9,26,9],[24,5,24,7],[24,2,24,4],[25,4,26,4],[25,5,26,5],[25,6,26,6],[25,7,25,8],[27,2,27,3],[28,1,28,3],[11,0,11,9],[13,7,13,9],[8,2,8,3],[6,5,7,5],[6,6,7,6],[6,7,6,8],[6,9,7,9],[6,0,7,0],[6,1,7,1],[6,2,7,3]]}
[null,{"$f":"CONCATENATE(\"D.D.O. CODE :  \",'P. TOKEN'!B7)","v":"D.D.O. CODE :  07050308026"},null,null,null,null,"Trans ID No. :"]
[null,null,null,null,null,null,"               Date :"]
[]
[]
[{"$f":"CONCATENATE(\"SCHEDULE SHOWING THE AAS ARREARS CREDITED TO                                                              Z.P.P.F. / G.P.F.  FROM   01-02-10  TO  31-05-2011  (16MONTHS)  OF\",\"                                                                          \",PROCEEDINGS!C41,)","v":"SCHEDULE SHOWING THE AAS ARREARS CREDITED TO                                                              Z.P.P.F. / G.P.F.  FROM   01-02-10  TO  31-05-2011  (16MONTHS)  OF                                                                          SK.KHAJARAHAMTULLA, S.G.T., MPPS(G), POTLAPADU"}]
[null,null,"IN THE MONTH OF",null,null,{"$f":"'WORK SHEET'!E62","v":"2009-08-06"}]
{"$rows_left_out":28}
{"sheet":"PT SCHEDULE","index":12,"n_rows":32,"n_cols":10,"rows_kept":32,"cut":false,"hidden":false,"merged":[[0,0,0,9],[3,0,3,9],[1,0,1,9],[43,5,43,9],[2,0,2,3],[2,4,2,5],[4,0,4,9],[31,0,31,9],[36,5,36,9]]}
["STATEMENT SHOWING THE SCHEDULE RECOVERY OF PROFESSIONAL TAX IN PRC 2010 BILL OF "]
[{"$f":"CONCATENATE('WORK SHEET'!E2,\" \",'WORK SHEET'!E3,\" \",'WORK SHEET'!E4,\" FOR THE MONTH OF\")","v":"SK.KHAJARAHAMTULLA MPPS(G) POTLAPADU FOR THE MONTH OF"}]
["from 1-02-10 to ",null,null,null,{"$f":"'WORK SHEET'!E135","v":"2011-07-30T00:14:24"}]
["Head of Account: \"0028 Other Taxes on income & Expenditure MR.. 107 Taxes on profession"]
["Trades Calling and Employment S.H.01 Receipt (from) four professions                                                    Trades Calling and Employment\""]
["Sl.No.","Employee Code","Name of the Employee & Degn","MONTH","NEW GROSS","NEW P.T.","OLD GROSS","OLD P.T.","Amount of Recovery","Remarks"]
{"$rows_left_out":27}
{"sheet":"49-(1P)","index":13,"n_rows":18,"n_cols":14,"rows_kept":18,"cut":false,"hidden":false,"merged":[[0,0,0,13],[1,0,1,13],[2,0,2,13],[4,0,4,13],[5,13,6,13],[5,7,5,8],[5,0,6,0],[5,12,6,12],[5,4,6,4],[5,9,6,9],[5,5,5,6],[5,11,6,11],[16,9,16,12],[5,1,6,1],[5,2,6,2],[5,3,6,3],[5,10,6,10],[12,11,12,12],[12,4,12,10],[15,9,15,12]]}
["A.P.T.C. FORM - 49"]
["(See subsidiary Rule 13 under Treasury Rule 10)"]
["PERIODICAL INCREMENT CERTIFICATE"]
["ANNEXURE"]
["(1) Certified that every Government Servant (s) named below has have been earned and prescribed periodical increment from date / dates noted in column (10) and either I(a) has / have been the incumbent or the appointment indicated against his name / their names for a period not less than _____years since the date in column (5) or (if he has / they have been suspended for misconduct) column (7) after deducting the periods between the dates showing in columns (3) and has (9) and has been subjected in any order of stoppage of increment as panaulty during the periods and during the periods of leave on average pay taken at a time from _____________ to ______________ and from _____________ to _______________ which has / have been counted for increments / in the case of officiating Government servents / Servents named below the / they would have officiated in the post / posts but for his / thier going on leave or __________"]
["sno","Name","Appointment","Whether substantive or officiating","Date from which present pay is drawn","Suspension for misconduct",null,"Leave without pay and in the case of those holding the post temporarily or in an officiating capacity all kinds of leave other than leave on average pay during which they would have continued to officiate in the post but for their going on leave upto a maximum of four months of such leave taken at time.",null,"Date from which increment may be given ","Scale of pay ","Present pay","Amount of increment","Future pay"]
{"$rows_left_out":13}
{"sheet":"49-(2P)","index":14,"n_rows":20,"n_cols":11,"rows_kept":20,"cut":false,"hidden":false,"merged":[[0,1,0,12],[3,0,3,13],[5,0,5,13],[13,5,13,12]]}
["Note :","1. When an increment claimed operates to carry Government Servant over an efficiancy hav ethe claim should be supported by a declaration from the competent authority that it has satisfied itself that the character and efficiency of the Government Servant concerned are such that he is fit to pass the above column (5) and (10) to (14) should be filled up in red ink. 2. The terms leave on average pay upto a maximum of 4 months where ever occuring from includes earned leave upto a maximum of 100 days or 50 days or 30 days in case may be for a Government Servants governed by the Andhra Pradesh Leave Rules, 1988 are concerned.  3. The service of the individuals satisfactor and no disciplinary cases are pending against during the period of increment. "]
[]
[]
["CERTIFICATE"]
[]
["(As laid down in Government Memo No.104215 A/1620/Pen.11/56-1, Dated 10-1-1977)"]
{"$rows_left_out":15}
{"sheet":"PREAMBLE","index":15,"n_rows":28,"n_cols":15,"rows_kept":28,"cut":false,"hidden":true,"merged":[[0,0,0,15],[9,0,9,15],[16,0,16,5],[16,6,16,15]]}
["PREAMBLE"]
[]
[null,null,"Sri/Smt./Kum.",{"$f":"CONCATENATE('WORK SHEET'!E2,\", \",'WORK SHEET'!E54,\", \",'WORK SHEET'!E3,\", \",'WORK SHEET'!E4,\", \",'WORK SHEET'!E5,\" \",\"MANDAL\",)","v":"SK.KHAJARAHAMTULLA, , MPPS(G), POTLAPADU, KURICHEDU MANDAL"}]
["is opted to come under revised pay scales, 2010 with effect from",null,null,null,null,null,null,{"$f":"#REF!","v":{"$error":"#REF!"}},{"$f":"#REF!","v":{"$error":"#REF!"}},null,null,{"$f":"CONCATENATE(\"He/She was drawning existing pay\")","v":"He/She was drawning existing pay"}]
[{"$f":"CONCATENATE(\"Rs.\",#REF!)","v":{"$error":"#REF!"}},null,{"$f":"CONCATENATE(\"in the time scale of \",#REF!,CONCATENATE(\" in the cadre of \",#REF!,\" his/her pay fixed at Rs.\",#REF!,\" in the time scale of \",#REF!))","v":{"$error":"#REF!"}}]
[{"$f":"CONCATENATE(\"and released periodical increments raising pay from Rs.\",#REF!,\" to \",#REF!,#REF!,\" in the time scale\", PROCEEDINGS!#REF!,\" with effect from\")","v":{"$error":"#REF!"}},null,null,null,null,null,null,null,null,null,null,null,null,{"$f":"PROCEEDINGS!#REF!","v":{"$error":"#REF!"}}]
{"$rows_left_out":23}
{"sheet":"Sheet1","index":16,"n_rows":0,"n_cols":0,"rows_kept":0,"cut":false,"hidden":false,"merged":[]}

{"sheet":"Sheet2","index":17,"n_rows":0,"n_cols":0,"rows_kept":0,"cut":false,"hidden":false,"merged":[]}

{"sheet":"Sheet3","index":18,"n_rows":0,"n_cols":0,"rows_kept":0,"cut":false,"hidden":false,"merged":[]}