{"text_format":"1","workbook":"xlsx","n_sheets":19,"sheets":["INSTRUCTIONS","WORK SHEET","P. TOKEN","ANNEX-I & II","101","PROCEEDINGS","47-FRONT","BILL-NOTIONAL","BILL-P.F & CASH","BILL","47-BUDGET","P.F SCHEDULE","PT SCHEDULE","49-(1P)","49-(2P)","PREAMBLE","Sheet1","Sheet2","Sheet3"],"not_rendered":{"charts":0,"images":4,"macros":1,"external_links":2,"defined_names":1,"comments":1,"pivot_tables":0},"unopened":[],"bounds":{"document_bytes":16777216,"sheet_cells":100000,"rows_first":2000,"rows_last":500,"rows_between":2000,"halvings":0,"cell_chars":16384,"cell_head_chars":4096},"cells_cut":0,"cells_raw":0,"read":"whole","date_system":"1900"}

{"sheet":"INSTRUCTIONS","index":0,"n_rows":43,"n_cols":10,"rows_kept":43,"cut":false,"hidden":false,"merged":[[1,0,1,14],[31,1,32,14],[0,0,0,14],[4,0,4,13],[40,2,40,10],[39,2,39,10],[27,1,27,14],[38,1,38,14],[42,1,42,13],[3,0,3,14],[28,1,29,14],[28,0,29,0],[33,1,34,14],[36,1,37,14],[30,1,30,14],[35,1,35,14],[24,1,24,6],[25,9,25,15],[24,9,24,15],[14,5,14,11],[41,2,41,10]]}
[]
["INSTRUCTIONS TO USE THE AUTOMATIC ADVANCEMENT SCHEME (AAS) SOFTWARE"]
[]
["THIS IS A FREE SOFTWARE PREPARED FOR THE BENEFIT OF A.P. UNITED TEACHERS FEDERATION "]
["MEMBERS OF UTF PRAKASAM"]
[]
[null,null,null,null,"PREPARED BY "]
[]
[null,null,null,null,null,"SANNAMURI MARUTHI"]
[null,null,null,null,null,"SCHOOL ASSISTANT (MATHS)"]
[null,null,null,null,null,"Z.P.H. SCHOOL "]
[null,null,null,null,null,"CHAKRAYAPALEM"]
[null,null,null,null,null,"ADDANKI MANDAL"]
[null,null,null,null,null,"PRAKASAM DIST."]
[null,null,null,null,null,"Mail ID: maruthisannamuri@rediffmail.com"]
[]
["GUIDED BY",null,null,null,null,null,null,null,"TECHNICALLY GUIDED BY"]
[]
[null,"AAVULA THIRUMALESH",null,null,null,null,null,null,null,"SRINIVASARAO THANGA (                           )"]
[null,"HEADMASTER",null,null,null,null,null,null,null,"S.A.(P.S.)"]
[null,"Z.P.H. SCHOOL ",null,null,null,null,null,null,null,"Z.P.H.SCHOOL"]
[null,"DAMMALAPADU",null,null,null,null,null,null,null,"MANGINAPUDI"]
[null,"MUPPALLA MANDAL",null,null,null,null,null,null,null,"DONAKONDA(MANDAL)"]
[null,"GUNTUR DIST.",null,null,null,null,null,null,null,"PRAKASAM(DT)"]
[null,"Mail ID: thirumalaaavula@rediffmail.com",null,null,null,null,null,null,null,"Mail ID: srinivasarao.thanga@gmail.com"]
[null,null,null,null,null,null,null,null,null,"Site URL: http://iteacherz.blogspot.com"]
[]
["1.","THIS SOFTWARE WILL BE WORKED ONLY IN MS EXCEL 2007 ONLY"]
["2.","SELECT THE WORK SHEET \"TAB\" AND FILL THE DATA IN BLUE COLOUR CELLS  AND TAKE THE PRINT IN LEGAL SHEETS"]
[]
["3.","THIS IS MAY NOT BE WORK FOR 18 YEARS SCALE IN THE PROMOTION POST"]
["4.","THE TEACHERS SHOULD CAREFUL AT SCALES IN THE PROCEEDINGS FOR 24 YEARS SCALE HOLDERS (ie THEY HAVE TO ENTER THE REMARKS COLUMN MANUALLY IN PROCEEDINGS)"]
[]
["5.","AMPLE CARE HAS BEEN TAKEN IN PREPARING THIS EXCEL BOOK. WE ARE NOT RESPONSEBLE FOR ANY IRREGULARITY DONE BY USING THIS EXCEL BOOK."]
[]
["6.","MAKE USE OF THIS EXCEL BOOK AND DO THE AAS BILLS AT  THE EARLIEST POSSIBLE"]
["7.","IF YOU WANT CHANGE MANUALLY UNPROTECT ANY SHEET OTHER THAN INSTRUCTIONS AND WORKSHEET, PASSWORD IS dheeraj"]
[]
["8.","SINCE THIS IS MACRO ENABLED WORK BOOK, DO THE FOLLOWING"]
[null,null,"1. Click the Microsoft Office Button(          ), and then click Excel Options."]
[null,null,"2. Click Trust Center, click Trust Center Settings, and then click Macro Settings. "]
[null,null,"3. Then check the radio button Enable all macros."]
[null,"WISH YOU ALL THE BEST"]

{"sheet":"WORK SHEET","index":1,"n_rows":965,"n_cols":126,"rows_kept":965,"cut":false,"hidden":false,"merged":[[43,4,43,6],[44,4,44,6],[34,4,34,6],[35,4,35,6],[36,4,36,6],[38,4,38,6],[39,4,39,6],[31,4,31,6],[32,4,32,6],[33,4,33,6],[40,4,40,6],[41,4,41,6],[24,4,24,6],[25,4,25,6],[26,4,26,6],[29,4,29,6],[30,4,30,6],[19,4,19,6],[20,4,20,6],[21,4,21,6],[22,4,22,6],[23,4,23,6],[13,4,13,6],[14,4,14,6],[15,4,15,6],[17,4,17,6],[18,4,18,6],[8,4,8,6],[9,4,9,6],[10,4,10,6],[11,4,11,6],[12,4,12,6],[3,4,3,6],[4,4,4,6],[5,4,5,6],[6,4,6,6],[7,4,7,6],[41,1,44,1],[1,7,6,9],[99,14,99,15],[100,14,100,15],[98,14,98,15],[40,1,40,2],[16,4,16,6],[35,1,35,2],[36,1,36,2],[38,1,38,2],[31,1,31,2],[32,1,32,2],[34,1,34,2],[42,7,45,8],[1,4,1,6],[2,4,2,6],[101,14,101,15],[1,1,1,2],[2,1,2,2],[3,1,3,2],[4,1,4,2],[16,1,16,2],[8,1,8,2],[33,1,33,2],[28,1,28,2],[24,1,24,2],[25,1,25,2],[29,1,29,2],[20,1,20,2],[21,1,21,2],[22,1,22,2],[27,1,27,2],[0,0,0,6],[13,0,23,0],[1,0,11,0],[9,1,9,2],[10,1,10,2],[11,1,11,2],[12,1,12,2],[5,1,5,2],[6,1,6,2],[7,1,7,2],[17,1,17,2],[18,1,18,2],[19,1,19,2],[13,1,13,2],[14,1,14,2],[15,1,15,2]]}
["WORK SHEET"]
["Individual Data","NAME OF THE TEACHER",null,":","SK.KHAJARAHAMTULLA",null,null,"PLEASE READ THE INSTRECTIONS CAREFULLY BEFORE FILL THE WORK SHEET"]
[null,"SCHOOL ",null,":","MPPS(G)"]
[null,"VILLAGE / TOWN",null,":","POTLAPADU"]
[null,"MANDAL",null,":","KURICHEDU"]
[null,"DISTRICT",null,":","PRAKASAM"]
[null,"EMPLOYEE CODE",null,":",724731]
[null,"BANK ACCOUNT NO.",null,":",11393579473]
[null,"G.P.F / ZPPF ",null,":","Z.P.P.F."]
[null,"G.P.F / ZPPF NO.",null,null,17396]
[null,"APGLI No.",null,":","L2107590"]
[null,"APGLI PREMIUM",null,":Rs",450]
[null,"DO YOU HAVE EXEMPTION WITH AGE ?(APGLI)",null,null,"NO"]
["DDO Data","PROCEEDINGS Rc.No.",null,":","2/AAS/2011"]
[null,"PROCEEDINGS DATE",null,":","2011-08-01"]
[null,"NAME OF THE D.D.O.( IF G.H.M. Enter Dy.E.O. )",null,":","N.vijayakumar"]
[null,"DDO CODE ",null,":",7050308026]
[null,"NAME OF SUB-TREASURY",null,":","STO;DARSI"]
[null,"BANK CODE",null,":",3641]
[null,"NAME OF THE BANK",null,":","SYNDICATE BANK DARSI"]
[null,"NAME OF THE MESSENGER",null,":","J.V.V.M.SUDHAKAR"]
[null,"MESSENGER DESIGNATION",null,":","M.R.P"]
[null,"ARE  YOU A GAZITTED HEAD MASTER?",null,":","NO"]
[null,null,"YOUR EDUCATIONAL DIVISION NAME",":","NO"]
[null,"POST HELD ( AS ON 1/02/2010 )",null,":","S.G.T."]
[null,"SCALE ( ORDINARY / SG / SPP / SAPP ) ON 1/02/2010",null,":","S.G"]
[null,null,"CHOOSE THE PATRON DO YOU HAVE?",null,"S.G./SPP-1/SPP-II"]
["Bill Data","DATE OF JOIN IN THE  POST WHICH HELD ON 1/2/2010",null,":",6,"AUGUST",1997]
[null,"BILL CLAIMED UPTO (LAST DAY OF MONTH)",null,":",30,"JULY",2011]
[null,"TYPE OF SCHOOL NOW WORKING",null,":","M.P.P.School"]
[null,"WHETHER DEPARTMENTAL TESTS PASSED",null,null,"NO"]
[null,"WHETHER SUBSTANTIVE OR OFFICIATING",null,":","SUBSTANTIVE"]
[null,"BASIC PAY ( AS ON 1/2/2010 )",null,":Rs",14440]
[null,"F.P",null,":Rs",0]
[null,"P.P",null,":Rs",0]
[null,"HRA % (ON 1/2/2010)",null,":","10 &12"]
[null,"IF HRA CHANGED THEN CHANGED HRA %",null,":","10 &12"]
[null,null,"HRA%  CHANGED DATE",":",1,"APRIL",2010]
[null,"INCREMENT MONTH ( ON 1ST JULY 2008 )",null,":","AUGUST"]
[null,null,"ARE YOU TAKEN 8/16/24 AFTER 01-02-2010?",null,"NO"]
[null,"DID YOU GET PROMOTION AFTER 01-02-2010?",null,":","NO"]
[null,"IF PROMOTED","PROMO. FIX. OPTED (D.O.P. / NEXT INCRE.)",":"]
[null,null,"DATE OF PROMOTION",":",null,null,null,{"$f":"J78","v":"YOU HAVE BENIFIT"}]
[null,null,"POST HELD ( AFTER PROMOTION )",":"]
[null,null,"SCALE OF PAY ( AFTER PROMOTION )",":Rs"]
[null,null,"ARE YOU HAVE E.O.L.s IN THIS CADRE?",null,"NO",null,null,null,null,null,null,null,null,null,null,null,null,null,null,null,null,null,null,null,null,"6700-200-7300-220-7960-240-8680-260-9460-280-10300-300-11200-330-12190-360-13270-390-14440-420-15700-450-17050-490-18520-530-20110-570-21820-610-23650-650-25600-700-27700-750-29950-800-32350-850-34900-900-37600-970-40510-1040-43630-1110-46960-1200-51760-130055660(80)"]
[null,null,"FILL THE DATES (MM/DD/YYYY)FORM"]
[null,null,"PUT '0'(1/0/1900) IN THE REMAINING BOXES"]
[]
[]
[null,null,"TO INCREMENT MONTH",null,{"$f":"IF(E126<8,E126+12,E126)","v":8},{"$f":"E126","v":8},null,{"$f":"IF(E36=E37,\"x\",\"y\")","v":"x"}]
[null,null,null,null,null,null,null,null,null,null,null,null,null,null,null,null,null,null,null,null,null,null,null,null,1,6500,6700,6900,1,null,null,null,5470,"5470-12385","10900-31550","5470-145-6040-155-6505-170-7015-185-7570-200-8170-215-8815-235-9520-255-10285-280-11125-315-12385","10900-300-11200-330-12190-360-13270-390-14440-420-15700-450-17050-490-18520-530-20110-570-21820-610-23650-650-25600-700-27700-750-29950-800-31550",10900,8,"2008-08-01",40026,"2008-07-01","2009-07-01","2010-07-01",1,"Assistance to Local Bodies for Primary Education",0,3,"Teaching Grant to Mandal Praja Parishad",5,1,"Elementry Education","MANDAL EDUCATIONAL OFFICER",{"$f":"E5","v":"KURICHEDU"},"D.E.O",{"$f":"CONCATENATE(\"MRC, \",E5)","v":"MRC, KURICHEDU"},1," ONE",null,6500,1,"2011-07-25","2008-07-01"]
[null,null,{"$f":"IF(E26=N87,1,IF(E26=N88,2,IF(E26=N89,3,IF(E26=N90,4,IF(E26=N91,5,6)))))","v":2},1,null,{"$f":"IF(C53=1,6,IF(C53=D54,12,IF(OR(C53=D55,C53=D57),18,24)))","v":12},null,null,null,null,null,null,null,{"$f":"F47","v":"00:00:00"},"00:00:00",{"$f":"IF(N53=0,0,O53-N53+1)","v":0},null,null,null,null,null,null,null,null,2,6700,{"$f":"AA52+200","v":6900},7100,2,6500,null,null,5750,"5750-13030","11530-33200","5750-145-6040-155-6505-170-7015-185-7570-200-8170-215-8815-235-9520-255-10285-280-11125-315-12700-330-13030","11530-330-12190-360-13270-390-14440-420-15700-450-17050-490-18520-530-20110-570-21820-610-23650-650-25600-700-27700-750-29950-800-31550-8",11530,9,"2008-09-01",40057,"2008-08-01","2009-08-01","2010-08-01",2,"Assistance to Local Bodies for Secondary Education",9,1,"Teaching Grant to Zilla Praja Parishads",5,2,"Secondary Education","HEAD MASTER",{"$f":"CONCATENATE(E3,\"  \",E4)","v":"MPPS(G)  POTLAPADU"},"DEPUTY EDUCATIONAL OFFICER",{"$f":"CONCATENATE(\"ZPHS, \",E4)","v":"ZPHS, POTLAPADU"},2," TWO ",null,6700,2,"2011-07-26","2008-07-02",null,null,null,null,1,2,3,4,5,6,7,8]
[null,null,null,2,null,null,null,null,null,null,null,null,null,"00:00:00","00:00:00",{"$f":"IF(N54=0,0,O54-N54+1)","v":0},null,null,null,null,null,null,null,null,3,{"$f":"Z53+200","v":6900},{"$f":"AA53+200","v":7100},7300,3,6700,null,null,7200,"7200-16925","14860-39540","7200-185-7570-200-8170-215-8815-235-9520-255-10285-280-11125-315-12700-330-13030-360-13750-425-15025-475-16925","14860-420-15700-450-17050-490-18520-530-20110-570-21820-610-23650-650-25600-700-27700-750-29950-800-32350-850-34900-900-37600-970-39540",14860,10,"2008-10-01",40087,"2008-09-01","2009-09-01","2010-09-01",3,"Government Primary Schools",0,1,"Primary Schools",4,1,"Elementry Education","MANDAL EDUCATIONAL OFFICER",{"$f":"BB52","v":"KURICHEDU"},"D.E.O",{"$f":"BD52","v":"MRC, KURICHEDU"},3," THREE ",null,{"$f":"BH53+200","v":6900},3,"2011-07-27","2008-07-03",null,{"$f":"BP67","v":"2010-02-01"},{"$f":"E81","v":"2010-02-01"},{"$f":"IF(AND(E41=O106,E42=O113,BN54>BN58),F68,BN54)","v":"2010-02-01"},{"$f":"IF(BO54=BP67,\" \",BO54)","v":" "}," "," "," "," "," "," "," "]
[null,null,null,3,null,null,null,null,null,null,null,null,null,"00:00:00","00:00:00",{"$f":"IF(N55=0,0,O55-N55+1)","v":0},null,null,null,null,null,null,null,null,4,{"$f":"Z54+200","v":7100},{"$f":"AA54+200","v":7300},7520,4,{"$f":"AD54+200","v":6900},null,null,7385,"7385-17475","15280-40510","7385-185-7570-200-8170-215-8815-235-9520-255-10285-280-11125-315-12700-330-13030-360-13750-425-15025-475-16925-550-17475","15280-420-15700-450-17050-490-18520-530-20110-570-21820-610-23650-650-25600-700-27700-750-29950-800-32350-850-34900-900-37600-970-40510",15280,11,"2008-11-01",40118,"2008-10-01","2009-10-01","2010-10-01",4,"Government Secondary Schools",0,9,"Secondary Schools",4,2,"Secondary Education","HEAD MASTER",{"$f":"BB53","v":"MPPS(G)  POTLAPADU"},"DEPUTY EDUCATIONAL OFFICER",{"$f":"CONCATENATE(E3,\" \",E4)","v":"MPPS(G) POTLAPADU"},4," FOUR ",null,{"$f":"BH54+200","v":7100},4,"2011-07-28","2008-07-04",null,{"$f":"BQ67","v":"2010-08-01"},{"$f":"E82","v":"2010-08-01"},{"$f":"IF(AND(E41=O106,E42=O113,BN55>BN58),F68,BN55)","v":"2010-08-01"},{"$f":"IF(BO55=BP68,\" \",BO55)","v":"2010-08-01"}," "," "," "," "," "," "," "]
[null,null,null,4,null,null,null,null,null,null,null,null,null,"00:00:00","00:00:00",{"$f":"IF(N56=0,0,O56-N56+1)","v":0},null,null,null,null,null,null,null,null,5,{"$f":"Z55+200","v":7300},{"$f":"AA55+220","v":7520},7740,5,{"$f":"AD55+200","v":7100},null,null,9285,"9285-21550","18030-43630","9285-235-9520-255-10285-280-11125-315-12700-330-13030-360-13750-425-15025-475-16925-550-19675-625-21550","18030-490-18520-530-20110-570-21820-610-23650-650-25600-700-27700-750-29950-800-32350-850-34900-900-37600-970-40510-1040-43630",18030,12,"2008-12-01",40148,"2008-11-01","2009-11-01","2010-11-01",null,null,null,null,null,null,null,null,null,null,null,null,5," FIVE ",null,{"$f":"BH55+200","v":7300},5,"2011-07-29","2008-07-05",null,{"$f":"BR67","v":"2011-08-01"},"2011-08-01",{"$f":"IF(AND(E41=O106,E42=O113,BN56>BN58),F68,BN56)","v":"2011-08-01"},{"$f":"IF(BO56=BP69,\" \",BO56)","v":"2011-08-01"},"2011-08-01"," "," "," "," "," "," "]
[null,null,null,5,null,null,null,null,null,null,null,null,null,null,null,null,null,null,null,null,null,null,null,null,6,{"$f":"Z56+220","v":7520},{"$f":"AA56+220","v":7740},7960,6,{"$f":"AD56+200","v":7300},null,null,10285,"10285-24200","19050-45850","10285-280-11125-315-12700-330-13030-360-13750-425-15025-475-16925-550-19675-625-22800-700-24200","19050-530-20110-570-21820-610-23650-650-25600-700-27700-750-29950-800-32350-850-34900-900-37600-970-40510-1040-43630-1110-45860",19050,13,"2009-01-01",40179,"2008-12-01","2009-12-01","2010-12-01",null,null,null,null,null,null,null,null,null,null,null,null,6," SIX ",null,{"$f":"BH56+220","v":7520},6,"2011-07-30","2008-07-06",null,{"$f":"BS67","v":"2012-08-01"},"2012-08-01",{"$f":"IF(AND(E41=O106,E42=O113,BN57>BN58),F68,BN57)","v":"2012-08-01"},{"$f":"IF(BO57=BP70,\" \",BO57)","v":"2012-08-01"},"2012-08-01","2012-08-01"," "," "," "," "," "]
[null,null,null,6,null,null,null,null,null,null,null,null,null,"OR","SG","SPP-I","SPP-II","SAPP-I","SAPP-II",0,0,null,null,null,7,{"$f":"Z57+220","v":7740},{"$f":"AA57+220","v":7960},8200,7,{"$f":"AD57+220","v":7520},null,null,10845,"10845-25600","19050-45850","10845-280-11125-315-12700-330-13030-360-13750-425-15025-475-16925-550-19675-625-22800-700-25600","19050-530-20110-570-21820-610-23650-650-25600-700-27700-750-29950-800-32350-850-34900-900-37600-970-40510-1040-43630-1110-45860",19050,14,"2009-02-01",40210,"2009-01-01","2010-01-01","2011-01-01",null,null,null,null,null,null,null,null,null,null,null,null,7," SEVEN ",null,{"$f":"BH57+220","v":7740},7,"2011-07-31","2008-07-07",null,{"$f":"BT67","v":"00:00:00"},"2010-08-01",{"$f":"BN58","v":"2010-08-01"},{"$f":"IF(BO58=BP71,\" \",BO58)","v":"2010-08-01"}," "," "," "," "," "," "," "]
[null,null,null,null,null,null,null,null,null,null,null,null,1,10900,11530,14860,18030,11860,15280,10900,"10900-300-11200-330-12190-360-13270-390-14440-420-15700-450-17050-490-18520-530-20110-570-21820-610-23650-650-25600-700-27700-750-29950-800-31550","10900-31550",null,null,8,{"$f":"Z58+220","v":7960},{"$f":"AA58+240","v":8200},8440,8,{"$f":"AD58+220","v":7740},null,null,null,null,null,null,null,null,15,"2009-03-01",40238,"2009-02-01","2010-02-01","2011-02-01",null,null,null,null,null,null,null,null,null,null,null,null,8," EIGHT",null,{"$f":"BH58+220","v":7960},8,"2011-08-01","2008-07-08",null,{"$f":"BU67","v":"00:00:00"},"2010-08-01",{"$f":"IF(AND(E41=O106,E42=O113),BN59,F68)","v":"2010-02-01"},{"$f":"IF(BO59=BP72,\" \",BO59)","v":" "}," "," "," "," "," "," "," "]
[null,null,null,null,null,null,null,null,null,null,null,null,2,14860,15280,18030,18030,16150,18030,11530,"11530-330-12190-360-13270-390-14440-420-15700-450-17050-490-18520-530-20110-570-21820-610-23650-650-25600-700-27700-750-29950-800-32350-850-33200","11530-33200",null,null,9,{"$f":"Z59+240","v":8200},{"$f":"AA59+240","v":8440},8680,9,{"$f":"AD59+220","v":7960},null,null,null,null,null,null,null,null,16,"2009-04-01",40269,"2009-03-01","2010-03-01","2011-03-01",null,null,null,null,null,null,null,null,null,null,null,null,9," NINE ",null,{"$f":"BH59+240","v":8200},9,"2011-08-02","2008-07-09",null,{"$f":"BV67","v":"00:00:00"},"2010-08-01",{"$f":"IF(AND(E41=O106,E42=O113),BN60,F68)","v":"2010-02-01"},{"$f":"IF(BO60=BP73,\" \",BO60)","v":" "}," "," "," "," "," "," "," "]
[null,null,"EOL DAYS",null,null,null,null,null,null,null,null,null,3,18030,19050,19050,21820,19050,20680,11860,"11860-330-12190-360-13270-390-14440-420-15700-450-17050-490-18520-530-20110-570-21820-610-23650-650-25600-700-27700-750-29950-800-32350-850-34050","11860-34050",null,null,10,{"$f":"Z60+240","v":8440},{"$f":"AA60+240","v":8680},8940,10,{"$f":"AD60+240","v":8200},null,null,null,null,null,null,null,0,17,"2009-05-01",40299,"2009-04-01","2010-04-01","2011-04-01",null,null,null,null,null,null,null,null,null,null,null,null,10," TEN ",null,{"$f":"BH60+240","v":8440},10,"2011-08-03","2008-07-10",null,{"$f":"BW67","v":"00:00:00"},"2010-02-01",{"$f":"BN61","v":"2010-02-01"},{"$f":"IF(BO61=BP74,\" \",BO61)","v":" "}," "," "," "," "," "," "," "]
[null,null,"C,DATE OF JOINING",null,{"$f":"DATE(YEAR(E63)+F53,MONTH(E63),DAY(E63))","v":"2009-08-06"},null,{"$f":"IF(E62<E66,1,2)","v":1},null,null,null,null,null,null,null,null,null,null,null,null,14860,"14860-420-15700-450-17050-490-18520-530-20110-570-21820-610-23650-650-25600-700-27700-750-29950-800-32350-850-34900-900-37600-970-39540","14860-39540",null,null,11,{"$f":"Z61+240","v":8680},{"$f":"AA61+260","v":8940},9200,11,{"$f":"AD61+240","v":8440},null,null,null,null,null,null,null,null,18,"2009-06-01",40330,"2009-05-01","2010-05-01","2011-05-01",null,null,null,null,null,null,null,null,null,null,null,null,11," ELEVEN ",null,{"$f":"BH61+240","v":8680},11,"2011-08-04","2008-07-11",null,null,"2010-02-01",{"$f":"BN62","v":"2010-02-01"}," ",{"$f":"IF(BP62=BQ75,\" \",BP62)","v":" "},{"$f":"IF(BQ62=BR75,\" \",BQ62)","v":" "},{"$f":"IF(BR62=BS75,\" \",BR62)","v":" "},{"$f":"IF(BS62=BT75,\" \",BS62)","v":" "},{"$f":"IF(BT62=BU75,\" \",BT62)","v":" "},{"$f":"IF(BU62=BV75,\" \",BU62)","v":" "},{"$f":"IF(BV62=BW75,\" \",BV62)","v":" "},{"$f":"IF(BW62=BX75,\" \",BW62)","v":" "}]
[null,null,"EOL EVALUATE DATE",null,{"$f":"E134+E64","v":"1997-08-06"},null,{"$f":"E63+2*(3*365+366)","v":"2005-08-06"},{"$f":"IF(AND(G63<=E135,G63>BC164),G63,0)","v":"00:00:00"},null,null,"PR.SCALE",null,{"$f":"IF(E25=Q121,3,IF(OR(E25=Q122,E25=Q123,E25=Q124,E25=Q125,E25=Q126,E25=Q127,E25=Q128,E25=Q129,E25=Q135,E25=Q136),2,1))","v":1},{"$f":"VLOOKUP(M63,M59:S61,M64+1,TRUE)","v":11530},{"$f":"VLOOKUP(N63,T58:U68,2,TRUE)","v":"11530-330-12190-360-13270-390-14440-420-15700-450-17050-490-18520-530-20110-570-21820-610-23650-650-25600-700-27700-750-29950-800-32350-850-33200"},null,null,null,null,15280,"15280-450-17050-490-18520-530-20110-570-21820-610-23650-650-25600-700-27700-750-29950-800-32350-850-34900-900-37600-970-40510","15280-40510",null,null,12,{"$f":"Z62+260","v":8940},{"$f":"AA62+260","v":9200},9460,12,{"$f":"AD62+240","v":8680},null,null,null,null,null,null,null,null,19,"2009-07-01",40360,"2009-06-01","2010-06-01","2011-06-01",null,null,null,null,null,null,null,null,null,null,null,null,12," TWELVE ",null,{"$f":"BH62+260","v":8940},12,"2011-08-05","2008-07-12"]
[null,null,"EOL DAYS",null,{"$f":"IF(E46=O107,0,SUM(P53:P56))","v":0},null,{"$f":"E63+4*(3*365+366)","v":"2013-08-06"},{"$f":"IF(AND(G64<=E135,G64>BC164),G64,0)","v":"00:00:00"},null,null,null,null,{"$f":"IF(E26=N87,1,IF(E26=N88,2,IF(E26=N89,3,IF(E26=N90,4,IF(E26=N91,5,6)))))","v":2},null,null,null,null,null,null,16150,"16150-450-17050-490-18520-530-20110-570-21820-610-23650-650-25600-700-27700-750-29950-800-32350-850-34900-900-37600-970-40510-1040-42590","16150-42590",null,null,13,{"$f":"Z63+260","v":9200},{"$f":"AA63+260","v":9460},9740,13,{"$f":"AD63+260","v":8940},null,null,null,null,null,null,null,null,0,"00:00:00",0,"2009-07-01","2010-07-01","2011-07-01",null,null,null,null,null,null,null,null,null,null,null,null,13," THIRTEEN",null,{"$f":"BH63+260","v":9200},13,"2011-08-06","2008-07-13"]
[null,null,"PROMOTION DATE",null,{"$f":"IF(E41=\"YES\",E138,E135+1)","v":"2011-07-31T00:14:24"},null,{"$f":"E63+6*(3*365+366)","v":"2021-08-06"},{"$f":"IF(AND(G65<=E135,G65>BC164),G65,0)","v":"00:00:00"},null,null,null,null,{"$f":"IF(E27=N95,1,IF(E27=N96,2,3))","v":1},null,null,null,null,null,null,18030,"18030-530-20110-570-21820-610-23650-650-25600-700-27700-750-29950-800-32350-850-34900-900-37600-970-40510-1040-43630","18030-43630",null,null,14,{"$f":"Z64+260","v":9460},{"$f":"AA64+280","v":9740},10020,14,{"$f":"AD64+260","v":9200},null,null,null,null,null,null,null,null,"2010-01-01","1900-02-11T09:21:36",16.263999999999999,"2009-08-01","2010-08-01","2011-08-01",null,null,null,null,null,null,null,null,null,null,null,null,14," FOURTEEN ",null,{"$f":"BH64+260","v":9460},14,"2011-08-07","2008-07-14"]
[null,null,"MIN(PRO,BILL)",null,{"$f":"MIN(E65,E135+1)","v":"2011-07-31T00:14:24"},null,{"$f":"MAX(H63:H65)","v":"00:00:00"},{"$f":"IF(E40=O106,1,2)","v":2},null,null,null,"prpost",{"$f":"IF(E44=Q121,3,IF(OR(E44=Q122,E44=Q123,E44=Q124,E44=Q125,E44=Q126,E44=Q127,E44=Q128,E44=Q129,E44=Q135,E44=Q136),2,1))","v":1},{"$f":"VLOOKUP(M66,M59:S61,2,TRUE)","v":10900},{"$f":"VLOOKUP(N66,T59:V68,3,TRUE)","v":"10900-31550"},null,null,null,null,19050,"19050-530-20110-570-21820-610-23650-650-25600-700-27700-750-29950-800-32350-850-34900-900-37600-970-40510-1040-43630-1110-45850","19050-45850",null,null,15,{"$f":"Z65+280","v":9740},{"$f":"AA65+280","v":10020},10300,15,{"$f":"AD65+260","v":9460},null,null,null,null,null,null,null,null,"2010-07-01","1900-02-20T19:26:24",24.824000000000002,"2009-09-01","2010-09-01","2011-09-01",null,null,null,null,null,null,null,null,null,null,null,null,15," FIFTEEN ",null,{"$f":"BH65+280","v":9740},15,"2011-08-08","2008-07-15",null,null,null,null,1,2,3,4,5,6,7,8]
[null,null,"HRA CHANGE DATE",null,{"$f":"E136","v":"2010-04-01T00:01:26.400"},"2010-02-01",null,null,null,null,null,null,1,2,3,null,null,null,null,20680,"20680-570-21820-610-23650-650-25600-700-27700-750-29950-800-32350-850-34900-900-37600-970-40510-1040-43630-1110-46960","20680-46960",null,null,16,{"$f":"Z66+280","v":10020},{"$f":"AA66+280","v":10300},10600,16,{"$f":"AD66+280","v":9740},null,null,null,null,null,null,null,null,"2011-01-01",60.287999999999997,29.96,"2009-10-01","2010-10-01","2011-10-01",null,null,null,null,null,null,null,null,null,null,null,null,16," SIXTEEN ",null,{"$f":"BH66+280","v":10020},16,"2011-08-09","2008-07-16",null,null,null,1,{"$f":"MIN(BO54:BO62)","v":"2010-02-01"},{"$f":"MIN(BP54:BP62)","v":"2010-08-01"},"2011-08-01","2012-08-01","00:00:00","00:00:00","00:00:00","00:00:00","00:00:00"]
[null,null,"8/16/24 DATE",null,{"$f":"IF(H66=1,G66,F68)","v":"2010-02-01"},{"$f":"MIN(E65,F67)","v":"2010-02-01"},{"$f":"IF(E41=O106,E138,E135)","v":"2011-07-30T00:14:24"},null,null,null,null,6,2,{"$f":"M68","v":2},{"$f":"N68","v":2},null,null,null,null,21820,"21820-610-23650-650-25600-700-27700-750-29950-800-32350-850-34900-900-37600-970-40510-1040-43630-1110-46960-1200-48160","21820-48160",null,null,17,{"$f":"Z67+280","v":10300},{"$f":"AA67+300","v":10600},10900,17,{"$f":"AD67+280","v":10020},null,null,null,null,null,null,null,null,"2011-07-01",60.287999999999997,29.96,"2009-11-01","2010-11-01","2011-11-01",null,null,null,null,null,null,null,null,null,null,null,null,17," SEVENTEEN ",null,{"$f":"BH67+280","v":10300},17,"2011-08-10","2008-07-17",null,null,null,2,{"$f":"BP67","v":"2010-02-01"},{"$f":"BQ67","v":"2010-08-01"},{"$f":"BR67","v":"2011-08-01"},{"$f":"BS67","v":"2012-08-01"},{"$f":"BT67","v":"00:00:00"},{"$f":"BU67","v":"00:00:00"},{"$f":"BV67","v":"00:00:00"},{"$f":"BW67","v":"00:00:00"},{"$f":"MIN(BW55:BW63)","v":"00:00:00"}]
[null,null," 6/12/18/24 DATE",null,{"$f":"IF(E62<E66,E62,F67)","v":"2009-08-06"},{"$f":"IF(E69<F67,F67,E69)","v":"2010-02-01"},{"$f":"DATE(YEAR(E69),MONTH(E69),1)","v":"2009-08-01"},null,null,null,null,12,3,3,5,null,null,null,null,null,null,null,null,null,18,{"$f":"Z68+300","v":10600},{"$f":"AA68+300","v":10900},11200,18,{"$f":"AD68+280","v":10300},null,null,null,null,null,null,null,null,null,{"$f":"IF(E36=N113,12,IF(E36=N114=14.5,E36))","v":12},{"$f":"IF(E36=N113,10,IF(E36=N114=12.5,E36))","v":10},"2009-12-01","2010-12-01","2011-12-01",null,null,null,null,null,null,null,null,null,null,null,null,18," EIGHTEEN ",null,{"$f":"BH68+300","v":10600},18,"2011-08-11","2008-07-18",null,null,null,3,{"$f":"BP68","v":"2010-02-01"},{"$f":"BQ68","v":"2010-08-01"},{"$f":"BR68","v":"2011-08-01"},{"$f":"BS68","v":"2012-08-01"},"00:00:00","00:00:00","00:00:00","00:00:00",{"$f":"MIN(BW56:BW64)","v":"00:00:00"}]
[null,null,null,null,null,null,null,null,null,null,null,18,4,4,6,null,null,null,null,null,null,null,null,null,19,{"$f":"Z69+300","v":10900},{"$f":"AA69+300","v":11200},11530,19,{"$f":"AD69+300","v":10600},null,null,null,null,null,null,null,null,null,{"$f":"IF(E37=N113,12,IF(E37=N114,14.5,E37))","v":12},{"$f":"IF(E37=N113,10,IF(E37=N114,12.5,E37))","v":10},"2010-01-01","2011-01-01","2012-01-01",null,null,null,null,null,null,null,null,null,null,null,null,19," NINETEEN ",null,{"$f":"BH69+300","v":10900},19,"2011-08-12","2008-07-19",null,null,null,4,"2010-02-01","2010-08-01","2011-08-01","2012-08-01","00:00:00","00:00:00","00:00:00","00:00:00",{"$f":"MIN(BW57:BW65)","v":"00:00:00"}]
[null,null,"ALREADY DRAWN INCREMENTS",null,{"$f":"F67","v":"2010-02-01"},{"$f":"AF89","v":"2010-02-01"},{"$f":"E33","v":14440},{"$f":"IF(F71=0,0,G71)","v":14440},"1900-01-01",null,null,24,7,8,8,null,null,null,null,null,null,null,null,null,20,{"$f":"Z70+300","v":11200},{"$f":"AA70+330","v":11530},11860,20,{"$f":"AD70+300","v":10900},null,null,null,null,null,null,null,null,null,null,"2011-04-01","2010-02-01","2011-02-01","2012-02-01",null,null,null,null,null,null,null,null,null,null,null,null,20," TWENTY ",null,{"$f":"BH70+300","v":11200},20,"2011-08-13","2008-07-20",null,null,null,5,"2010-02-01","2010-08-01","2011-08-01","2012-08-01","00:00:00","00:00:00","00:00:00","00:00:00",{"$f":"MIN(BW58:BW66)","v":"1900-01-08"}]
[null,null,"increment date",null,{"$f":"DATE(IF(OR(F51=1,F51=2),2011,2010),F51,1)","v":"2010-08-01"},{"$f":"AF90","v":"2010-08-01"},{"$f":"VLOOKUP(G71,Z52:AB135,IF(OR(AND(E41=O106,E42=O113,E75=F72),AND(E41=O106,E42=O112,F71=E75)),3,2),TRUE)","v":14860},{"$f":"IF(F72=0,0,G72)","v":14860},"1900-01-02",null,"AAS GRADE",null,null,{"$f":"VLOOKUP(F53,L67:O71,M65+1,TRUE)","v":3},{"$f":"IF(N72=2,3,IF(OR(N72=3,N72=4),4,IF(OR(N72=5,N72=6),6,IF(N72=7,5,8))))","v":4},null,null,null,null,null,null,null,null,null,21,{"$f":"Z71+330","v":11530},{"$f":"AA71+330","v":11860},12190,21,{"$f":"AD71+300","v":11200},null,null,null,null,null,null,null,null,null,null,null,"2010-03-01","2011-03-01","2012-03-01",null,null,null,null,null,null,null,null,null,null,null,null,21," TWENTY ONE ",null,{"$f":"BH71+330","v":11530},21,"2011-08-14","2008-07-21",null,null,null,6,"2010-02-01","2010-08-01","2011-08-01","2012-08-01","00:00:00","00:00:00","00:00:00","00:00:00",{"$f":"MIN(BW59:BW67)","v":"00:00:00"}]
[null,null,null,null,{"$f":"DATE(YEAR(E72)+1,MONTH(E72),1)","v":"2011-08-01"},{"$f":"AF91","v":"2011-08-01"},{"$f":"VLOOKUP(G72,Z52:AB135,IF(OR(AND(E41=O106,E42=O113,E75=F73),AND(E41=O106,E42=O112,F72=E75)),3,2),TRUE)","v":15280},15280,"1900-01-03",null,null,null,null,{"$f":"IF(N72=2,\"S.G.\",IF(N72=3,\"S.P.P.-1A\",IF(N72=4,\"S.P.P-IB\",IF(N72=5,\"S.A.P.P.-IA\",IF(N72=6,\"S.A.P.P.-IB\",IF(N72=7,\"S.P.P.-II\",S.A.P.P.-II))))))","v":"S.P.P.-1A"},{"$f":"VLOOKUP(M63,M59:S61,O72,TRUE)","v":14860},{"$f":"VLOOKUP(O73,T58:U68,2,TRUE)","v":"14860-420-15700-450-17050-490-18520-530-20110-570-21820-610-23650-650-25600-700-27700-750-29950-800-32350-850-34900-900-37600-970-39540"},null,null,null,null,null,null,null,null,22,{"$f":"Z72+330","v":11860},{"$f":"AA72+330","v":12190},12550,22,{"$f":"AD72+330","v":11530},null,null,null,null,null,null,null,null,null,null,null,"2010-04-01","2011-04-01","2012-04-01",null,null,null,null,null,null,null,null,null,null,null,null,22," TWENTY TWO ",null,{"$f":"BH72+330","v":11860},22,"2011-08-15","2008-07-22",null,null,null,7,"2010-02-01","2010-08-01","2011-08-01","2012-08-01","00:00:00","00:00:00","00:00:00","00:00:00",{"$f":"MIN(BW60:BW68)","v":"00:00:00"}]
[null,null,null,null,{"$f":"DATE(YEAR(E73)+1,MONTH(E73),1)","v":"2012-08-01"},"2012-08-01",{"$f":"VLOOKUP(G73,Z52:AB135,IF(OR(AND(E41=O106,E42=O113,E75=F74),AND(E41=O106,E42=O112,F73=E75)),3,2),TRUE)","v":15700},15700,"1900-01-04",null,null,null,null,{"$f":"IF(F53=24,\" as per FR 31(2)\",IF(F53=18,\" \",\" as per FR 22(a)(i)\"))","v":" as per FR 22(a)(i)"},null,null,null,null,null,null,null,null,null,null,23,{"$f":"Z73+330","v":12190},{"$f":"AA73+360","v":12550},12910,23,{"$f":"AD73+330","v":11860},null,null,null,null,null,null,null,null,null,null,null,"2010-05-01","2011-05-01","2012-05-01",null,null,null,null,null,null,null,null,null,null,null,null,23," TWENTY THREE ",null,{"$f":"BH73+330","v":12190},23,"2011-08-16","2008-07-23",null,null,null,8,"2010-02-01","2010-08-01","2011-08-01","2012-08-01","00:00:00","00:00:00","00:00:00","00:00:00",{"$f":"MIN(BW61:BW69)","v":"00:00:00"}]
[null,null,"promotion date",null,{"$f":"IF(E41=O106,E138,E72)","v":"2010-08-01"},"00:00:00",{"$f":"VLOOKUP(G74,Z52:AB135,IF(OR(AND(E41=O106,E42=O113,E75=F75),AND(E41=O106,E42=O112,F74=E75)),3,2),TRUE)","v":16150},0,"1900-01-05",null,null,null,null,null,null,null,null,null,null,null,null,null,null,null,24,{"$f":"Z74+360","v":12550},{"$f":"AA74+360","v":12910},13270,24,{"$f":"AD74+330","v":12190},null,null,null,null,null,null,null,null,null,null,null,"2010-06-01","2011-06-01","2012-06-01",null,null,null,null,null,null,null,null,null,null,null,null,24," TWENTY FOUR ",null,{"$f":"BH74+360","v":12550},24,"2011-08-17","2008-07-24",null,null,null,9,"2010-02-01","2010-08-01","2011-08-01","2012-08-01","00:00:00","00:00:00","00:00:00","00:00:00",{"$f":"MIN(BW62:BW70)","v":"00:00:00"}]
[null,null,null,null,{"$f":"IF(AND(E41=O106,E42=O113),DATE(YEAR(E75)+1,MONTH(E75),1),E75)","v":"2010-08-01"},"00:00:00",{"$f":"VLOOKUP(G75,Z52:AB135,IF(OR(AND(E41=O106,E42=O113,E75=F76),AND(E41=O106,E42=O112,F75=E75)),3,2),TRUE)","v":16600},0,"1900-01-06",null,null,null,null,null,null,null,null,null,null,null,null,null,null,null,25,{"$f":"Z75+360","v":12910},{"$f":"AA75+360","v":13270},13660,25,{"$f":"AD75+360","v":12550},null,null,null,null,null,null,null,null,null,null,null,"2010-07-01","2011-07-01","2012-07-01",null,null,null,null,null,null,null,null,null,null,null,null,25," TWENTY FIVE ",null,{"$f":"BH75+360","v":12910},25,"2011-08-18","2008-07-25",null,null,null,10,"2010-02-01","2010-08-01","2011-08-01","2012-08-01","00:00:00","00:00:00","00:00:00","00:00:00",{"$f":"MIN(BW63:BW71)","v":"00:00:00"}]
[null,null,null,null,{"$f":"IF(AND(E41=O106,E42=O113),DATE(YEAR(E76)+1,MONTH(E76),1),E76)","v":"2010-08-01"},"00:00:00",{"$f":"VLOOKUP(G76,Z52:AB135,IF(OR(AND(E41=O106,E42=O113,E75=F77),AND(E41=O106,E42=O112,F76=E75)),3,2),TRUE)","v":17050},0,"1900-01-07",null,null,null,null,null,null,null,null,null,null,null,null,null,null,null,26,{"$f":"Z76+360","v":13270},{"$f":"AA76+390","v":13660},14050,26,{"$f":"AD76+360","v":12910},null,null,null,null,null,null,null,null,null,null,null,null,null,null,null,null,null,null,null,null,null,null,null,null,null,null,26," TWENTY SIX",null,{"$f":"BH76+360","v":13270},26,"2011-08-19","2008-07-26"]
[null,null,null,null,{"$f":"E68","v":"2010-02-01"},"00:00:00",{"$f":"VLOOKUP(G77,Z52:AB135,IF(OR(AND(E41=O106,E42=O113,E75=F78),AND(E41=O106,E42=O112,F77=E75)),3,2),TRUE)","v":17540},0,"1900-01-08",{"$f":"IF(F244=G244,\"YOU HAVE NO BENIFIT NOW\",\"YOU HAVE BENIFIT\")","v":"YOU HAVE BENIFIT"},null,null,null,"PROPOST",{"$f":"IF(N66>O73,O66,G97)","v":"14860-39540"},null,null,null,null,null,null,null,null,null,27,{"$f":"Z77+390","v":13660},{"$f":"AA77+390","v":14050},14440,27,{"$f":"AD77+360","v":13270},null,null,null,null,null,null,null,null,null,null,null,null,null,null,null,null,null,null,null,null,null,null,null,null,null,null,27," TWENTY SEVEN ",null,{"$f":"BH77+390","v":13660},27,"2011-08-20","2008-07-27",null,null,null,null,null,0,0,0,0,0,0]
[null,null,null,null,null,null,null,null,null,null,null,null,null,null,null,null,null,null,null,null,null,null,null,null,28,{"$f":"Z78+390","v":14050},{"$f":"AA78+390","v":14440},14860,28,{"$f":"AD78+390","v":13660},null,null,null,null,null,null,null,null,null,null,null,null,null,null,null,null,null,null,null,null,null,null,null,null,null,null,28," TWENTY EIGHT",null,{"$f":"BH78+390","v":14050},28,"2011-08-21","2008-07-28",null,null,"2010-02-01",{"$f":"E135","v":"2011-07-30T00:14:24"},{"$f":"IF(BN79<BO79,BN79,0)","v":"2010-02-01"},{"$f":"BILL!D5","v":40210},{"$f":"IF(BQ79=0,BR78+0.1,BQ79)","v":40210},{"$f":"BILL!Z5","v":18233},{"$f":"BILL!X5","v":150},{"$f":"BILL!P5","v":18763},{"$f":"BILL!N5","v":150},{"$f":"VLOOKUP(BN79,BR78:BV111,2,TRUE)","v":18233},{"$f":"VLOOKUP(BN79,BR78:BV111,3,TRUE)","v":150},{"$f":"VLOOKUP(BN79,BR78:BV111,4,TRUE)","v":18763},{"$f":"VLOOKUP(BN79,BR78:BV111,5,TRUE)","v":150}]
[null,null,null,null,null,null,null,null,{"$f":"F81","v":"2010-02-01"},null,null,null,null,null,null,null,null,null,null,null,null,null,null,null,29,{"$f":"Z79+390","v":14440},{"$f":"AA79+420","v":14860},15280,29,{"$f":"AD79+390","v":14050},null,null,null,null,null,null,null,null,null,null,null,null,null,null,null,null,null,null,null,null,null,null,null,null,null,null,29," TWENTY NINE",null,{"$f":"BH79+390","v":14440},29,"2011-08-22","2008-07-29",null,null,"2010-03-01",{"$f":"BO79","v":"2011-07-30T00:14:24"},{"$f":"IF(BN80<BO80,BN80,0)","v":"2010-03-01"},{"$f":"BILL!D6","v":40238},{"$f":"IF(BQ80=0,BR79+0.1,BQ80)","v":40238},{"$f":"BILL!Z6","v":18233},{"$f":"BILL!X6","v":150},{"$f":"BILL!P6","v":18763},{"$f":"BILL!N6","v":150},{"$f":"VLOOKUP(BN80,BR78:BV111,2,TRUE)","v":18233},{"$f":"VLOOKUP(BN80,BR78:BV111,3,TRUE)","v":150},{"$f":"VLOOKUP(BN80,BR78:BV111,4,TRUE)","v":18763},{"$f":"VLOOKUP(BN80,BR78:BV111,5,TRUE)","v":150}]
[null,null,"TO BE DRAWN INCREMENTS",1,{"$f":"E71","v":"2010-02-01"},{"$f":"IF(BM54=0,MAX(E81:E88),BM54)","v":"2010-02-01"},{"$f":"VLOOKUP(E33,Z52:AB128,IF(AND(E62<=F67,E62<E66),2,1),TRUE)","v":14860},{"$f":"IF(F81=0,0,G81)","v":14860},{"$f":"F82","v":"2010-08-01"},1,null,null,null,null,null,null,null,null,null,null,null,null,null,null,30,{"$f":"Z80+420","v":14860},{"$f":"AA80+420","v":15280},15700,30,{"$f":"AD80+390","v":14440},null,null,null,null,null,null,null,null,null,null,null,null,null,null,null,null,null,null,null,null,null,null,null,null,null,null,30," THIRTY ",null,{"$f":"BH80+420","v":14860},30,"2011-08-23","2008-07-30",null,null,"2010-04-01",{"$f":"BO80","v":"2011-07-30T00:14:24"},{"$f":"IF(BN81<BO81,BN81,0)","v":"2010-04-01"},{"$f":"BILL!D7","v":40269},40269,{"$f":"BILL!Z7","v":18233},{"$f":"BILL!X7","v":150},{"$f":"BILL!P7","v":18763},{"$f":"BILL!N7","v":150},{"$f":"VLOOKUP(BN81,BR78:BV111,2,TRUE)","v":18233},{"$f":"VLOOKUP(BN81,BR78:BV111,3,TRUE)","v":150},{"$f":"VLOOKUP(BN81,BR78:BV111,4,TRUE)","v":18763},{"$f":"VLOOKUP(BN81,BR78:BV111,5,TRUE)","v":150}]
[null,null,null,2,{"$f":"E72","v":"2010-08-01"},{"$f":"IF(BM55=0,MAX(E81:E88),BM55)","v":"2010-08-01"},{"$f":"VLOOKUP(G81,Z52:AB135,IF(OR(AND(E41=O106,E42=O113,E85=F82),AND(E41=O106,E42=O112,F81=E85)),3,2),TRUE)","v":15280},{"$f":"IF(F82=0,0,G82)","v":15280},"2011-08-01",2,null,null,null,null,null,null,null,null,null,null,null,null,null,null,31,{"$f":"Z81+420","v":15280},{"$f":"AA81+420","v":15700},16150,31,{"$f":"AD81+420","v":14860},null,null,null,null,null,null,null,null,null,null,null,null,null,null,null,null,null,null,null,null,null,null,null,null,null,null,31," THIRTY ONE",null,{"$f":"BH81+420","v":15280},31,"2011-08-24","2008-07-31",null,null,"2010-05-01","2011-07-30T00:14:24","2010-05-01",{"$f":"BILL!D8","v":40299},40299,{"$f":"BILL!Z8","v":18233},{"$f":"BILL!X8","v":150},{"$f":"BILL!P8","v":18763},{"$f":"BILL!N8","v":150},{"$f":"VLOOKUP(BN82,BR78:BV111,2,TRUE)","v":18233},{"$f":"VLOOKUP(BN82,BR78:BV111,3,TRUE)","v":150},{"$f":"VLOOKUP(BN82,BR78:BV111,4,TRUE)","v":18763},{"$f":"VLOOKUP(BN82,BR78:BV111,5,TRUE)","v":150}]
[null,null,null,3,"2011-08-01",{"$f":"IF(BM56=0,MAX(E81:E88),BM56)","v":"2011-08-01"},{"$f":"VLOOKUP(G82,Z52:AB135,IF(OR(AND(E41=O106,E42=O113,E85=F83),AND(E41=O106,E42=O112,F82=E75)),3,2),TRUE)","v":15700},15700,"2012-08-01",3,null,null,null,null,null,null,null,null,null,null,null,null,null,null,32,{"$f":"Z82+420","v":15700},{"$f":"AA82+450","v":16150},16600,32,{"$f":"AD82+420","v":15280},null,null,null,null,null,null,null,null,null,null,null,null,null,null,null,null,null,null,null,null,null,null,null,null,null,null,32," THIRTY TWO ",null,{"$f":"BH82+420","v":15700},32,"2011-08-25","2008-08-01",null,null,"2010-06-01","2011-07-30T00:14:24","2010-06-01",{"$f":"BILL!D9","v":40330},40330,{"$f":"BILL!Z9","v":18233},{"$f":"BILL!X9","v":150},{"$f":"BILL!P9","v":18763},{"$f":"BILL!N9","v":150},{"$f":"VLOOKUP(BN83,BR78:BV111,2,TRUE)","v":18233},{"$f":"VLOOKUP(BN83,BR78:BV111,3,TRUE)","v":150},{"$f":"VLOOKUP(BN83,BR78:BV111,4,TRUE)","v":18763},{"$f":"VLOOKUP(BN83,BR78:BV111,5,TRUE)","v":150}]
[null,null,null,4,"2012-08-01",{"$f":"IF(BM57=0,MAX(E81:E88),BM57)","v":"2012-08-01"},{"$f":"VLOOKUP(G83,Z52:AB135,IF(OR(AND(E41=O106,E42=O113,E85=F84),AND(E41=O106,E42=O112,F83=E85)),3,2),TRUE)","v":16150},16150,"2012-08-01",4,null,null,null,null,null,null,null,null,null,null,null,null,null,null,33,{"$f":"Z83+450","v":16150},{"$f":"AA83+450","v":16600},17050,33,{"$f":"AD83+420","v":15700},null,null,null,null,null,null,null,null,null,null,null,null,null,null,null,null,null,null,null,null,null,null,null,null,null,null,33," THIRTY THREE ",null,{"$f":"BH83+450","v":16150},33,"2011-08-26","2008-08-02",null,null,"2010-07-01","2011-07-30T00:14:24","2010-07-01",{"$f":"BILL!D10","v":40360},40360,{"$f":"BILL!Z10","v":19469},{"$f":"BILL!X10","v":150},{"$f":"BILL!P10","v":20035},{"$f":"BILL!N10","v":200},{"$f":"VLOOKUP(BN84,BR78:BV111,2,TRUE)","v":19469},{"$f":"VLOOKUP(BN84,BR78:BV111,3,TRUE)","v":150},{"$f":"VLOOKUP(BN84,BR78:BV111,4,TRUE)","v":20035},{"$f":"VLOOKUP(BN84,BR78:BV111,5,TRUE)","v":200}]
[null,null,null,5,"2010-08-01",{"$f":"IF(BM58=0,MAX(E81:E88),BM58)","v":"2012-08-01"},{"$f":"VLOOKUP(G84,Z52:AB135,IF(OR(AND(E41=O106,E42=O113,E85=F85),AND(E41=O106,E42=O112,F84=E85)),3,2),TRUE)","v":16600},16600,"2012-08-01",5,null,null,null,null,null,null,null,null,null,null,null,null,null,null,34,{"$f":"Z84+450","v":16600},{"$f":"AA84+450","v":17050},17540,34,{"$f":"AD84+450","v":16150},null,null,null,null,null,null,null,null,null,null,null,null,null,null,null,null,null,null,null,null,null,null,null,null,null,null,34," THIRTY FOUR ",null,{"$f":"BH84+450","v":16600},34,"2011-08-27","2008-08-03",null,null,"2010-08-01","2011-07-30T00:14:24","2010-08-01",{"$f":"BILL!D11","v":40391},40391,{"$f":"BILL!Z11","v":20035},{"$f":"BILL!X11","v":200},{"$f":"BILL!P11","v":20601},{"$f":"BILL!N11","v":200},{"$f":"VLOOKUP(BN85,BR78:BV111,2,TRUE)","v":20035},{"$f":"VLOOKUP(BN85,BR78:BV111,3,TRUE)","v":200},{"$f":"VLOOKUP(BN85,BR78:BV111,4,TRUE)","v":20601},{"$f":"VLOOKUP(BN85,BR78:BV111,5,TRUE)","v":200}]
[null,null,null,6,"2010-08-01",{"$f":"IF(BM59=0,MAX(E81:E88),BM59)","v":"2012-08-01"},{"$f":"VLOOKUP(G85,Z52:AB135,IF(OR(AND(E41=O106,E42=O113,E85=F85),AND(E41=O106,E42=O112,F84=E85)),3,2),TRUE)","v":17050},17050,"2012-08-01",6,null,null,null,null,null,null,null,null,null,null,null,null,null,null,35,{"$f":"Z85+450","v":17050},{"$f":"AA85+490","v":17540},18030,35,{"$f":"AD85+450","v":16600},null,null,null,null,null,null,null,null,null,null,null,null,null,null,null,null,null,null,null,null,null,null,null,null,null,null,35," THIRTY FIVE ",null,{"$f":"BH85+450","v":17050},35,"2011-08-28","2008-08-04",null,null,"2010-09-01","2011-07-30T00:14:24","2010-09-01",{"$f":"BILL!D12","v":40422},40422,{"$f":"BILL!Z12","v":20035},{"$f":"BILL!X12","v":200},{"$f":"BILL!P12","v":20601},{"$f":"BILL!N12","v":200},{"$f":"VLOOKUP(BN86,BR78:BV111,2,TRUE)","v":20035},{"$f":"VLOOKUP(BN86,BR78:BV111,3,TRUE)","v":200},{"$f":"VLOOKUP(BN86,BR78:BV111,4,TRUE)","v":20601},{"$f":"VLOOKUP(BN86,BR78:BV111,5,TRUE)","v":200}]
[null,null,null,7,"2010-08-01",{"$f":"IF(BM60=0,MAX(E81:E88),BM60)","v":"2012-08-01"},{"$f":"VLOOKUP(G86,Z52:AB135,IF(OR(AND(E41=O106,E42=O113,E85=F87),AND(E41=O106,E42=O112,F86=E85)),3,2),TRUE)","v":17540},17540,"2012-08-01",7,null,null,null,"ORDINARY",0,"NIL",null,null,null,null,null,null,null,null,36,{"$f":"Z86+490","v":17540},{"$f":"AA86+490","v":18030},18520,36,{"$f":"AD86+450","v":17050},null,null,null,null,null,null,null,null,null,null,null,null,null,null,null,null,null,null,null,null,null,null,null,null,null,null,36," THIRTY SIX ",null,{"$f":"BH86+490","v":17540},36,"2011-08-29","2008-08-05",null,null,"2010-10-01","2011-07-30T00:14:24","2010-10-01",{"$f":"BILL!D13","v":40452},40452,{"$f":"BILL!Z13","v":20035},{"$f":"BILL!X13","v":200},{"$f":"BILL!P13","v":20601},{"$f":"BILL!N13","v":200},{"$f":"VLOOKUP(BN87,BR78:BV111,2,TRUE)","v":20035},{"$f":"VLOOKUP(BN87,BR78:BV111,3,TRUE)","v":200},{"$f":"VLOOKUP(BN87,BR78:BV111,4,TRUE)","v":20601},{"$f":"VLOOKUP(BN87,BR78:BV111,5,TRUE)","v":200}]
[null,null,null,8,{"$f":"F69","v":"2010-02-01"},{"$f":"IF(BM61=0,MAX(E81:E88),BM61)","v":"2012-08-01"},{"$f":"VLOOKUP(G87,Z52:AB135,IF(OR(AND(E41=O106,E42=O113,E85=F88),AND(E41=O106,E42=O112,F87=E85)),3,2),TRUE)","v":18030},18030,null,8,null,null,null,"S.G",1,"PHC ALVENCE",null,null,null,null,null,null,null,null,37,{"$f":"Z87+490","v":18030},{"$f":"AA87+490","v":18520},19050,37,{"$f":"AD87+490","v":17540},null,null,null,null,null,1,2,3,4,5,6,7,8,null,null,null,null,null,null,null,null,null,null,null,null,null,37," THIRTY SEVEN ",null,{"$f":"BH87+490","v":18030},37,"2011-08-30","2008-08-06",null,null,"2010-11-01","2011-07-30T00:14:24","2010-11-01",{"$f":"BILL!D14","v":40483},40483,{"$f":"BILL!Z14","v":20035},{"$f":"BILL!X14","v":200},{"$f":"BILL!P14","v":20601},{"$f":"BILL!N14","v":200},{"$f":"VLOOKUP(BN88,BR78:BV111,2,TRUE)","v":20035},{"$f":"VLOOKUP(BN88,BR78:BV111,3,TRUE)","v":200},{"$f":"VLOOKUP(BN88,BR78:BV111,4,TRUE)","v":20601},{"$f":"VLOOKUP(BN88,BR78:BV111,5,TRUE)","v":200}]
[null,null,null,null,{"$f":"IF(E68=G65,E68+0.01,E81)","v":"2010-02-01"},null,null,null,null,null,null,null,null,"S.P.P-1",2,"HMA-40",null,null,null,null,null,null,null,null,38,{"$f":"Z88+490","v":18520},{"$f":"AA88+530","v":19050},19580,38,{"$f":"AD88+490","v":18030},null,{"$f":"AJ102","v":"2010-02-01"},null,{"$f":"E71","v":"2010-02-01"},{"$f":"IF(AND(E41=O106,E42=O113,AH89>AH93),F68,AH89)","v":"2010-02-01"},{"$f":"IF(AI89=AJ102,\" \",AI89)","v":" "}," "," "," "," "," "," "," ",null,null,null,null,null,null,null,null,null,null,null,null,null,38," THIRTY EIGHT ",null,{"$f":"BH88+490","v":18520},38,"2011-08-31","2008-08-07",null,null,"2010-12-01","2011-07-30T00:14:24","2010-12-01",{"$f":"BILL!D15","v":40513},40513,{"$f":"BILL!Z15","v":20035},{"$f":"BILL!X15","v":200},{"$f":"BILL!P15","v":20601},{"$f":"BILL!N15","v":200},{"$f":"VLOOKUP(BN89,BR78:BV111,2,TRUE)","v":20035},{"$f":"VLOOKUP(BN89,BR78:BV111,3,TRUE)","v":200},{"$f":"VLOOKUP(BN89,BR78:BV111,4,TRUE)","v":20601},{"$f":"VLOOKUP(BN89,BR78:BV111,5,TRUE)","v":200}]
[null,null,null,null,null,null,null,null,null,null,null,null,null,"S.P.P.-II",3,"HMA-60",null,null,null,null,null,null,null,null,39,{"$f":"Z89+530","v":19050},{"$f":"AA89+530","v":19580},20110,39,{"$f":"AD89+490","v":18520},null,{"$f":"AK102","v":"2010-08-01"},null,{"$f":"E72","v":"2010-08-01"},{"$f":"IF(AND(E41=O106,E42=O113,AH90>AH93),F68,AH90)","v":"2010-08-01"},{"$f":"IF(AI90=AJ103,\" \",AI90)","v":"2010-08-01"}," "," ",{"$f":"IF(AL90=AM103,\" \",AL90)","v":" "}," "," "," "," ",null,null,null,null,null,null,null,null,null,null,null,null,null,39," THIRTY NINE ",null,{"$f":"BH89+530","v":19050},39,"2011-09-01","2008-08-08",null,null,"2011-01-01","2011-07-30T00:14:24","2011-01-01",{"$f":"BILL!D16","v":40544},40544,{"$f":"BILL!Z16","v":20798},{"$f":"BILL!X16","v":200},{"$f":"BILL!P16","v":21386},{"$f":"BILL!N16","v":200},{"$f":"VLOOKUP(BN90,BR78:BV111,2,TRUE)","v":20798},{"$f":"VLOOKUP(BN90,BR78:BV111,3,TRUE)","v":200},{"$f":"VLOOKUP(BN90,BR78:BV111,4,TRUE)","v":21386},{"$f":"VLOOKUP(BN90,BR78:BV111,5,TRUE)","v":200}]
[null,null,null,null,null,null,null,null,null,null,null,null,null,"S.A.P.P.-I",4,"HMA-75",null,null,null,null,null,null,null,null,40,{"$f":"Z90+530","v":19580},{"$f":"AA90+530","v":20110},20680,40,{"$f":"AD90+530","v":19050},null,{"$f":"AL102","v":"2011-08-01"},null,"2011-08-01",{"$f":"IF(AND(E41=O106,E42=O113,AH91>AH93),F68,AH91)","v":"2011-08-01"},"2011-08-01","2011-08-01"," "," "," "," "," "," ",null,null,null,null,null,null,null,null,null,null,null,null,null,40," FORTY ",null,{"$f":"BH90+530","v":19580},40,"2011-09-02","2008-08-09",null,null,"2011-02-01","2011-07-30T00:14:24","2011-02-01",{"$f":"BILL!D17","v":40575},40575,{"$f":"BILL!Z17","v":20798},{"$f":"BILL!X17","v":200},{"$f":"BILL!P17","v":21386},{"$f":"BILL!N17","v":200},{"$f":"VLOOKUP(BN91,BR78:BV111,2,TRUE)","v":20798},{"$f":"VLOOKUP(BN91,BR78:BV111,3,TRUE)","v":200},{"$f":"VLOOKUP(BN91,BR78:BV111,4,TRUE)","v":21386},{"$f":"VLOOKUP(BN91,BR78:BV111,5,TRUE)","v":200}]
[null,null,"date of first appointment",null,{"$f":"E134","v":"1997-08-06"},null,null,null,null,null,null,null,null,"S.A.P.P-II",5,"CCA @HYD",null,null,null,null,null,null,null,null,41,{"$f":"Z91+530","v":20110},{"$f":"AA91+570","v":20680},21250,41,{"$f":"AD91+530","v":19580},null,{"$f":"AM102","v":"2012-08-01"},null,"2012-08-01",{"$f":"IF(AND(E41=O106,E42=O113,AH92>AH93),F68,AH92)","v":"2012-08-01"},"2012-08-01","2012-08-01","2012-08-01"," "," "," "," "," ",null,null,null,null,null,null,null,null,null,null,null,null,null,41," FORTY ONE ",null,{"$f":"BH91+530","v":20110},41,"2011-09-03","2008-08-10",null,null,"2011-03-01","2011-07-30T00:14:24","2011-03-01",{"$f":"BILL!D18","v":40603},40603,{"$f":"BILL!Z18","v":20798},{"$f":"BILL!X18","v":200},{"$f":"BILL!P18","v":21386},{"$f":"BILL!N18","v":200},{"$f":"VLOOKUP(BN92,BR78:BV111,2,TRUE)","v":20798},{"$f":"VLOOKUP(BN92,BR78:BV111,3,TRUE)","v":200},{"$f":"VLOOKUP(BN92,BR78:BV111,4,TRUE)","v":21386},{"$f":"VLOOKUP(BN92,BR78:BV111,5,TRUE)","v":200}]
[null,null,"date of regularigation",null,{"$f":"E92","v":"1997-08-06"},null,null,null,null,null,null,null,null,null,6,"CCA @VIZ",null,null,null,null,null,null,null,null,42,{"$f":"Z92+570","v":20680},{"$f":"AA92+570","v":21250},21820,42,{"$f":"AD92+530","v":20110},null,{"$f":"AN102","v":"00:00:00"},null,"2010-08-01",{"$f":"AH93","v":"2010-08-01"},"2010-08-01"," "," "," "," "," "," "," ",null,null,null,null,null,null,null,null,null,null,null,null,null,42," FORTY TWO",null,{"$f":"BH92+570","v":20680},42,"2011-09-04","2008-08-11",null,null,"2011-04-01","2011-07-30T00:14:24","2011-04-01",{"$f":"BILL!D19","v":40634},40634,{"$f":"BILL!Z19","v":21095},{"$f":"BILL!X19","v":200},{"$f":"BILL!P19","v":21692},{"$f":"BILL!N19","v":200},{"$f":"VLOOKUP(BN93,BR78:BV111,2,TRUE)","v":21095},{"$f":"VLOOKUP(BN93,BR78:BV111,3,TRUE)","v":200},{"$f":"VLOOKUP(BN93,BR78:BV111,4,TRUE)","v":21692},{"$f":"VLOOKUP(BN93,BR78:BV111,5,TRUE)","v":200}]
[null,null,"daate of compleation of 6/12/18/24 years",null,{"$f":"E69","v":"2009-08-06"},{"$f":"F53","v":12},null,null,null,null,null,null,null,null,null,"CCA@ OTHERS",null,null,null,null,null,null,null,null,43,{"$f":"Z93+570","v":21250},{"$f":"AA93+570","v":21820},22430,43,{"$f":"AD93+570","v":20680},null,{"$f":"AO102","v":"00:00:00"},null,"2010-08-01",{"$f":"IF(AND(E41=O106,E42=O113),AH94,F68)","v":"2010-02-01"}," "," "," "," "," "," "," "," ",null,null,null,null,null,null,null,null,null,null,null,null,null,43," FORTY THREE ",null,{"$f":"BH93+570","v":21250},43,"2011-09-05","2008-08-12",null,null,"2011-05-01","2011-07-30T00:14:24","2011-05-01",{"$f":"BILL!D20","v":40664},40664,{"$f":"BILL!Z20","v":21095},{"$f":"BILL!X20","v":200},{"$f":"BILL!P20","v":21692},{"$f":"BILL!N20","v":200},{"$f":"VLOOKUP(BN94,BR78:BV111,2,TRUE)","v":21095},{"$f":"VLOOKUP(BN94,BR78:BV111,3,TRUE)","v":200},{"$f":"VLOOKUP(BN94,BR78:BV111,4,TRUE)","v":21692},{"$f":"VLOOKUP(BN94,BR78:BV111,5,TRUE)","v":200}]
[null,null,"perticulars of eol valied",null,{"$f":"IF(E64=0,\"NIL\",E64)","v":"NIL"},null,null,null,null,null,null,null,null,"S.G./SPP-1/SPP-II",null,null,null,null,null,null,null,null,null,null,44,{"$f":"Z94+570","v":21820},{"$f":"AA94+610","v":22430},23040,44,{"$f":"AD94+570","v":21250},null,{"$f":"AP102","v":"00:00:00"},null,"2010-08-01",{"$f":"IF(AND(E41=O106,E42=O113),AH95,F68)","v":"2010-02-01"}," "," "," "," "," "," "," "," ",null,null,null,null,null,null,null,null,null,null,null,null,null,44," FORTY FOUR ",null,{"$f":"BH94+570","v":21820},44,"2011-09-06","2008-08-13",null,null,"2011-06-01","2011-07-30T00:14:24","2011-06-01",{"$f":"BILL!D21","v":0},40664.1,{"$f":"BILL!Z21","v":0},{"$f":"BILL!X21","v":0},{"$f":"BILL!P21","v":0},{"$f":"BILL!N21","v":0},{"$f":"VLOOKUP(BN95,BR78:BV111,2,TRUE)","v":21095},{"$f":"VLOOKUP(BN95,BR78:BV111,3,TRUE)","v":200},{"$f":"VLOOKUP(BN95,BR78:BV111,4,TRUE)","v":21692},{"$f":"VLOOKUP(BN95,BR78:BV111,5,TRUE)","v":200}]
[null,null,"pay and scale of pay as on 1/11/2010",null,{"$f":"F244","v":14440},{"$f":"O63","v":"11530-330-12190-360-13270-390-14440-420-15700-450-17050-490-18520-530-20110-570-21820-610-23650-650-25600-700-27700-750-29950-800-32350-850-33200"},{"$f":"VLOOKUP(F96,U59:V68,2,TRUE)","v":"11530-33200"},null,null,null,null,null,null,"S.G./S.P.P-I/S.A.PP.-II",null,null,null,null,null,null,null,null,null,null,45,{"$f":"Z95+610","v":22430},{"$f":"AA95+610","v":23040},23650,45,{"$f":"AD95+570","v":21820},null,{"$f":"AQ102","v":"00:00:00"},null,"2010-02-01",{"$f":"AH96","v":"2010-02-01"}," "," "," "," "," "," "," "," ",null,null,null,null,null,null,null,null,null,null,null,null,null,45," FORTY FIVE ",null,{"$f":"BH95+610","v":22430},45,"2011-09-07","2008-08-14",null,null,"2011-07-01","2011-07-30T00:14:24","2011-07-01",{"$f":"BILL!D22","v":0},40664.199999999997,{"$f":"BILL!Z22","v":0},{"$f":"BILL!X22","v":0},{"$f":"BILL!P22","v":0},{"$f":"BILL!N22","v":0},{"$f":"VLOOKUP(BN96,BR78:BV111,2,TRUE)","v":20416},{"$f":"VLOOKUP(BN96,BR78:BV111,3,TRUE)","v":200},{"$f":"VLOOKUP(BN96,BR78:BV111,4,TRUE)","v":21692},{"$f":"VLOOKUP(BN96,BR78:BV111,5,TRUE)","v":200}]
[null,null,"pay in spoecial grade fixation as per fr.22a(i) on 1/11/2010",null,{"$f":"G244","v":14860},{"$f":"P73","v":"14860-420-15700-450-17050-490-18520-530-20110-570-21820-610-23650-650-25600-700-27700-750-29950-800-32350-850-34900-900-37600-970-39540"},{"$f":"VLOOKUP(F97,U59:V68,2,TRUE)","v":"14860-39540"},null,null,null,null,null,null,"S.G./S.A.PP-I/SAPP-II",null,null,null,null,null,null,null,null,null,null,46,{"$f":"Z96+610","v":23040},{"$f":"AA96+610","v":23650},24300,46,{"$f":"AD96+610","v":22430},null,null,null,null,null,null,null,null,null,null,null,null,null,null,null,null,null,null,null,null,null,null,null,null,null,null,46," FORTY SIX",null,{"$f":"BH96+610","v":23040},46,"2011-09-08","2008-08-15",null,null,"2011-08-01","2011-07-30T00:14:24","00:00:00",{"$f":"BILL!D23","v":0},40664.299999999996,{"$f":"BILL!Z23","v":0},{"$f":"BILL!X23","v":0},{"$f":"BILL!P23","v":0},{"$f":"BILL!N23","v":0},{"$f":"VLOOKUP(BN97,BR78:BV111,2,TRUE)","v":0},{"$f":"VLOOKUP(BN97,BR78:BV111,3,TRUE)","v":0},{"$f":"VLOOKUP(BN97,BR78:BV111,4,TRUE)","v":0},{"$f":"VLOOKUP(BN97,BR78:BV111,5,TRUE)","v":0}]
[null,null,"date of next increment",null,{"$f":"VLOOKUP(E135,F81:F88,1,TRUE)","v":"2010-08-01"},{"$f":"VLOOKUP(E98,F81:I87,4,TRUE)","v":"2011-08-01"},null,null,null,null,null,null,null,null,null,null,null,null,null,null,null,null,null,null,47,{"$f":"Z97+610","v":23650},{"$f":"AA97+650","v":24300},24950,47,{"$f":"AD97+610","v":23040},null,null,null,null,null,null,null,null,null,null,null,null,null,null,null,null,null,null,null,null,null,null,null,null,null,null,47," FORTY SEVEN ",null,{"$f":"BH97+610","v":23650},47,"2011-09-09","2008-08-16",null,null,"2011-09-01","2011-07-30T00:14:24","00:00:00",{"$f":"BILL!D24","v":0},40664.399999999994,{"$f":"BILL!Z24","v":0},{"$f":"BILL!X24","v":0},{"$f":"BILL!P24","v":0},{"$f":"BILL!N24","v":0},{"$f":"VLOOKUP(BN98,BR78:BV111,2,TRUE)","v":0},{"$f":"VLOOKUP(BN98,BR78:BV111,3,TRUE)","v":0},{"$f":"VLOOKUP(BN98,BR78:BV111,4,TRUE)","v":0},{"$f":"VLOOKUP(BN98,BR78:BV111,5,TRUE)","v":0}]
[null,null,null,null,null,null,null,null,null,null,null,null,null,0,{"$f":"IF(H131=1,200,IF(H131=2,120,100))","v":{"$error":"#REF!"}},null,0,null,null,null,null,null,null,null,48,{"$f":"Z98+650","v":24300},{"$f":"AA98+650","v":24950},25600,48,{"$f":"AD98+610","v":23650},null,null,null,null,null,null,null,null,null,null,null,null,null,null,null,null,null,null,null,null,null,null,null,null,null,null,48," FORTY EIGHT ",null,{"$f":"BH98+650","v":24300},48,"2011-09-10","2008-08-17",null,null,"2011-10-01","2011-07-30T00:14:24","00:00:00",{"$f":"BILL!D25","v":0},40664.499999999993,{"$f":"BILL!Z25","v":0},{"$f":"BILL!X25","v":0},{"$f":"BILL!P25","v":0},{"$f":"BILL!N25","v":0},{"$f":"VLOOKUP(BN99,BR78:BV111,2,TRUE)","v":0},{"$f":"VLOOKUP(BN99,BR78:BV111,3,TRUE)","v":0},{"$f":"VLOOKUP(BN99,BR78:BV111,4,TRUE)","v":0},{"$f":"VLOOKUP(BN99,BR78:BV111,5,TRUE)","v":0}]
[null,null,null,null,null,null,null,null,null,null,null,null,null,8201,{"$f":"IF(H131=1,300,IF(H131=2,160,120))","v":{"$error":"#REF!"}},null,4825,null,null,null,null,null,null,null,49,{"$f":"Z99+650","v":24950},{"$f":"AA99+650","v":25600},26300,49,{"$f":"AD99+650","v":24300},null,null,null,null,null,null,null,null,null,null,null,null,null,null,null,null,null,null,null,null,null,null,null,null,null,null,49," FORTY NINE ",null,{"$f":"BH99+650","v":24950},49,"2011-09-11","2008-08-18",null,null,"2011-11-01","2011-07-30T00:14:24","00:00:00",{"$f":"BILL!D26","v":0},40664.599999999991,{"$f":"BILL!Z26","v":0},{"$f":"BILL!X26","v":0},{"$f":"BILL!P26","v":0},{"$f":"BILL!N26","v":0},{"$f":"VLOOKUP(BN100,BR78:BV111,2,TRUE)","v":0},{"$f":"VLOOKUP(BN100,BR78:BV111,3,TRUE)","v":0},{"$f":"VLOOKUP(BN100,BR78:BV111,4,TRUE)","v":0},{"$f":"VLOOKUP(BN100,BR78:BV111,5,TRUE)","v":0}]
[null,null,null,null,{"$f":"VLOOKUP(F69,F81:J88,5,TRUE)","v":"1900-01-01"},{"$f":"VLOOKUP(E101,D81:G88,3,TRUE)","v":"2010-02-01"},null,{"$f":"VLOOKUP(E101,D81:H88,4,TRUE)","v":14860},{"$f":"VLOOKUP(H101,Z52:AD135,5,TRUE)","v":14440},null,null,null,null,13271,{"$f":"IF(H131=1,350,IF(H131=2,220,130))","v":{"$error":"#REF!"}},null,7770,null,null,null,null,null,null,null,50,{"$f":"Z100+650","v":25600},{"$f":"AA100+700","v":26300},27000,50,{"$f":"AD100+650","v":24950},null,null,null,null,null,1,2,3,4,5,6,7,8,null,null,null,null,null,null,null,null,null,null,null,null,null,50," FIFTY ",null,{"$f":"BH100+650","v":25600},50,"2011-09-12","2008-08-19",null,null,"2011-12-01","2011-07-30T00:14:24","00:00:00",{"$f":"BILL!D27","v":0},40664.69999999999,{"$f":"BILL!Z27","v":0},{"$f":"BILL!X27","v":0},{"$f":"BILL!P27","v":0},{"$f":"BILL!N27","v":0},{"$f":"VLOOKUP(BN101,BR78:BV111,2,TRUE)","v":0},{"$f":"VLOOKUP(BN101,BR78:BV111,3,TRUE)","v":0},{"$f":"VLOOKUP(BN101,BR78:BV111,4,TRUE)","v":0},{"$f":"VLOOKUP(BN101,BR78:BV111,5,TRUE)","v":0}]
[null,null,null,null,{"$f":"E101+1","v":"1900-01-02"},{"$f":"VLOOKUP(E102,D81:G88,3,TRUE)","v":"2010-08-01"},null,{"$f":"VLOOKUP(E102,D81:H88,4,TRUE)","v":15280},{"$f":"H101","v":14860},null,null,null,null,18031,{"$f":"IF(H131=1,525,IF(H131=2,350,140))","v":{"$error":"#REF!"}},null,10565,null,null,null,null,null,null,null,51,{"$f":"Z101+700","v":26300},{"$f":"AA101+700","v":27000},27700,51,{"$f":"AD101+650","v":25600},null,null,null,null,1,{"$f":"MIN(AI89:AI96)","v":"2010-02-01"},"2010-08-01","2011-08-01","2012-08-01","00:00:00","00:00:00","00:00:00","00:00:00",null,null,null,null,null,null,null,null,null,null,null,null,null,51," FIFTY ONE ",null,{"$f":"BH101+700","v":26300},51,"2011-09-13","2008-08-20",null,null,"2012-01-01","2011-07-30T00:14:24","00:00:00",{"$f":"BILL!D28","v":0},40664.799999999988,{"$f":"BILL!Z28","v":0},{"$f":"BILL!X28","v":0},{"$f":"BILL!P28","v":0},{"$f":"BILL!N28","v":0},{"$f":"VLOOKUP(BN102,BR78:BV111,2,TRUE)","v":0},{"$f":"VLOOKUP(BN102,BR78:BV111,3,TRUE)","v":0},{"$f":"VLOOKUP(BN102,BR78:BV111,4,TRUE)","v":0},{"$f":"VLOOKUP(BN102,BR78:BV111,5,TRUE)","v":0}]
[null,null,null,null,"1900-01-03",{"$f":"VLOOKUP(E103,D81:G88,3,TRUE)","v":"2011-08-01"},null,{"$f":"VLOOKUP(E103,D81:H88,4,TRUE)","v":15700},{"$f":"H102","v":15280},null,null,null,null,null,null,null,null,null,null,null,null,null,null,null,52,{"$f":"Z102+700","v":27000},{"$f":"AA102+700","v":27700},28450,52,{"$f":"AD102+700","v":26300},null,null,null,null,2,{"$f":"AJ102","v":"2010-02-01"},{"$f":"AK102","v":"2010-08-01"},{"$f":"AL102","v":"2011-08-01"},{"$f":"AM102","v":"2012-08-01"},{"$f":"AN102","v":"00:00:00"},"00:00:00","00:00:00","00:00:00",null,null,null,null,null,null,null,null,null,null,null,null,null,52," FIFTY TWO ",null,{"$f":"BH102+700","v":27000},52,"2011-09-14","2008-08-21",null,null,"2012-02-01","2011-07-30T00:14:24","00:00:00",0,40664.899999999987,{"$f":"BILL!Z29","v":0},{"$f":"BILL!X29","v":0},{"$f":"BILL!P29","v":0},{"$f":"BILL!N29","v":0},{"$f":"VLOOKUP(BN103,BR78:BV111,2,TRUE)","v":0},{"$f":"VLOOKUP(BN103,BR78:BV111,3,TRUE)","v":0},{"$f":"VLOOKUP(BN103,BR78:BV111,4,TRUE)","v":0},{"$f":"VLOOKUP(BN103,BR78:BV111,5,TRUE)","v":0}]
[null,null,null,null,"1900-01-04",{"$f":"VLOOKUP(E104,D81:G88,3,TRUE)","v":"2012-08-01"},null,{"$f":"VLOOKUP(E104,D81:H88,4,TRUE)","v":16150},15700,null,null,null,null,null,null,null,null,null,null,null,null,null,null,null,53,{"$f":"Z103+700","v":27700},{"$f":"AA103+750","v":28450},29200,53,{"$f":"AD103+700","v":27000},null,null,null,null,3,{"$f":"AJ103","v":"2010-02-01"},{"$f":"AK103","v":"2010-08-01"},{"$f":"AL103","v":"2011-08-01"},{"$f":"AM103","v":"2012-08-01"},"00:00:00","00:00:00","00:00:00","00:00:00",null,null,null,null,null,null,null,null,null,null,null,null,null,53," FIFYT THREE ",null,{"$f":"BH103+700","v":27700},53,"2011-09-15","2008-08-22",null,null,"2012-03-01","2011-07-30T00:14:24","00:00:00",{"$f":"BILL!D30","v":40695},40695,{"$f":"BILL!Z30","v":21095},{"$f":"BILL!X30","v":200},{"$f":"BILL!P30","v":21692},{"$f":"BILL!N30","v":200},{"$f":"VLOOKUP(BN104,BR78:BV111,2,TRUE)","v":0},{"$f":"VLOOKUP(BN104,BR78:BV111,3,TRUE)","v":0},{"$f":"VLOOKUP(BN104,BR78:BV111,4,TRUE)","v":0},{"$f":"VLOOKUP(BN104,BR78:BV111,5,TRUE)","v":0}]
[null,null,null,null,"1900-01-05",{"$f":"VLOOKUP(E105,D81:G88,3,TRUE)","v":"2012-08-01"},null,{"$f":"VLOOKUP(E105,D81:H88,4,TRUE)","v":16600},16150,null,null,null,null,null,null,null,null,null,null,null,null,null,null,null,54,{"$f":"Z104+750","v":28450},{"$f":"AA104+750","v":29200},29950,54,{"$f":"AD104+700","v":27700},null,null,null,null,4,"2010-02-01","2010-08-01","2011-08-01","2012-08-01","00:00:00","00:00:00","00:00:00","00:00:00",null,null,null,null,null,null,null,null,null,null,null,null,null,54," FIFTY FOUR ",null,{"$f":"BH104+750","v":28450},54,"2011-09-16","2008-08-23",null,null,"2012-04-01","2011-07-30T00:14:24","00:00:00",{"$f":"BILL!D31","v":40725},40725,{"$f":"BILL!Z31","v":20416},{"$f":"BILL!X31","v":200},{"$f":"BILL!P31","v":21692},{"$f":"BILL!N31","v":200},{"$f":"VLOOKUP(BN105,BR78:BV111,2,TRUE)","v":0},{"$f":"VLOOKUP(BN105,BR78:BV111,3,TRUE)","v":0},{"$f":"VLOOKUP(BN105,BR78:BV111,4,TRUE)","v":0},{"$f":"VLOOKUP(BN105,BR78:BV111,5,TRUE)","v":0}]
[null,null,null,null,"1900-01-06",{"$f":"VLOOKUP(E106,D81:G88,3,TRUE)","v":"2012-08-01"},null,{"$f":"VLOOKUP(E106,D81:H88,4,TRUE)","v":17050},16600,null,null,null,null,"Z.P.P.F.","YES","SUBSTANTIVE",null,"FR.22B ON",null,null,null,null,null,null,55,{"$f":"Z105+750","v":29200},{"$f":"AA105+750","v":29950},30750,55,{"$f":"AD105+750","v":28450},null,null,null,null,5,"2010-02-01","2010-08-01","2011-08-01","2012-08-01","00:00:00","00:00:00","00:00:00","00:00:00",null,null,null,null,null,null,null,null,null,null,null,null,null,55," FIFTY FIVE",null,{"$f":"BH105+750","v":29200},55,"2011-09-17","2008-08-24",null,null,"2012-04-02",{"$f":"BO105","v":"2011-07-30T00:14:24"},{"$f":"IF(BN106<BO106,BN106,0)","v":"00:00:00"},{"$f":"BILL!D32","v":0},40725.1,{"$f":"BILL!Z32","v":0},{"$f":"BILL!X32","v":0},{"$f":"BILL!P32","v":0},{"$f":"BILL!N32","v":0},{"$f":"VLOOKUP(BN106,BR78:BV111,2,TRUE)","v":0},{"$f":"VLOOKUP(BN106,BR78:BV111,3,TRUE)","v":0},{"$f":"VLOOKUP(BN106,BR78:BV111,4,TRUE)","v":0},{"$f":"VLOOKUP(BN106,BR78:BV111,5,TRUE)","v":0}]
[null,null,null,null,"1900-01-07",{"$f":"VLOOKUP(E107,D81:G88,3,TRUE)","v":"2012-08-01"},null,{"$f":"VLOOKUP(E107,D81:H88,4,TRUE)","v":17540},17050,null,null,null,null,"G.P.F.","NO","OFFICIATING",null,"FR.22a(i) ON",null,null,null,null,null,null,56,{"$f":"Z106+750","v":29950},{"$f":"AA106+800","v":30750},31550,56,{"$f":"AD106+750","v":29200},null,null,null,null,6,"2010-02-01","2010-08-01","2011-08-01","2012-08-01","00:00:00","00:00:00","00:00:00","00:00:00",null,null,null,null,null,null,null,null,null,null,null,null,null,56," FIFTY SIX ",null,{"$f":"BH106+750","v":29950},56,"2011-09-18","2008-08-25",null,null,"2012-04-03","2011-07-30T00:14:24","00:00:00",{"$f":"BILL!D33","v":0},40725.199999999997,{"$f":"BILL!Z33","v":0},{"$f":"BILL!X33","v":0},{"$f":"BILL!P33","v":0},{"$f":"BILL!N33","v":0},{"$f":"VLOOKUP(BN107,BR78:BV111,2,TRUE)","v":0},{"$f":"VLOOKUP(BN107,BR78:BV111,3,TRUE)","v":0},{"$f":"VLOOKUP(BN107,BR78:BV111,4,TRUE)","v":0},{"$f":"VLOOKUP(BN107,BR78:BV111,5,TRUE)","v":0}]
[null,null,null,null,null,{"$f":"F101","v":"2010-02-01"},null,{"$f":"IF(F108<>0,H101,0)","v":14860},{"$f":"IF(F108<>0,I101,0)","v":14440},{"$f":"G97","v":"14860-39540"},{"$f":"J108","v":"14860-39540"},{"$f":"IF(O113=E42,J108,K108)","v":"14860-39540"},null,"M.P.P.School",null,null,"JANUARY",{"$f":"IF(E42=O112,R106,R107)","v":"FR.22a(i) ON"},null,null,null,null,null,null,57,{"$f":"Z107+800","v":30750},{"$f":"AA107+800","v":31550},32350,57,{"$f":"AD107+750","v":29950},null,null,null,null,7,"2010-02-01","2010-08-01","2011-08-01","2012-08-01","00:00:00","00:00:00","00:00:00","00:00:00",null,null,null,null,null,null,null,null,null,null,null,null,null,57," FIFTY SEVEN ",null,{"$f":"BH107+800","v":30750},57,"2011-09-19","2008-08-26",null,null,"2012-04-04","2011-07-30T00:14:24","00:00:00",{"$f":"BILL!D34","v":0},40725.299999999996,{"$f":"BILL!Z34","v":0},{"$f":"BILL!X34","v":0},{"$f":"BILL!P34","v":0},{"$f":"BILL!N34","v":0},{"$f":"VLOOKUP(BN108,BR78:BV111,2,TRUE)","v":0},{"$f":"VLOOKUP(BN108,BR78:BV111,3,TRUE)","v":0},{"$f":"VLOOKUP(BN108,BR78:BV111,4,TRUE)","v":0},{"$f":"VLOOKUP(BN108,BR78:BV111,5,TRUE)","v":0}]
[null,null,null,null,null,{"$f":"IF(OR(F101=F102,F102>E135),0,F102)","v":"2010-08-01"},null,{"$f":"IF(F109<>0,H102,0)","v":15280},{"$f":"IF(F109<>0,I102,0)","v":14860},{"$f":"IF(F109=E138,O78,J108)","v":"14860-39540"},{"$f":"IF(F108=E138,O78,J108)","v":"14860-39540"},{"$f":"IF(O113=E42,J109,K109)","v":"14860-39540"},null,"M.P.U.P.School",null,null,"FEBRUARY",null,null,null,null,null,null,null,58,{"$f":"Z108+800","v":31550},{"$f":"AA108+800","v":32350},33200,58,{"$f":"AD108+800","v":30750},null,null,null,null,8,"2010-02-01","2010-08-01","2011-08-01","2012-08-01","00:00:00","00:00:00","00:00:00","00:00:00",null,null,null,null,null,null,null,null,null,null,null,null,null,58," FIFTY EIGHT",null,{"$f":"BH108+800","v":31550},58,"2011-09-20","2008-08-27",null,null,"2012-04-05","2011-07-30T00:14:24","00:00:00",{"$f":"BILL!D35","v":0},40725.399999999994,{"$f":"BILL!Z35","v":0},{"$f":"BILL!X35","v":0},{"$f":"BILL!P35","v":0},{"$f":"BILL!N35","v":0},{"$f":"VLOOKUP(BN109,BR78:BV111,2,TRUE)","v":0},{"$f":"VLOOKUP(BN109,BR78:BV111,3,TRUE)","v":0},{"$f":"VLOOKUP(BN109,BR78:BV111,4,TRUE)","v":0},{"$f":"VLOOKUP(BN109,BR78:BV111,5,TRUE)","v":0}]
[null,null,null,null,null,{"$f":"IF(OR(F102=F103,F103>E135),0,F103)","v":"00:00:00"},null,0,0,{"$f":"IF(F110=E138,O78,J109)","v":"14860-39540"},{"$f":"IF(F109=E138,O78,J109)","v":"14860-39540"},{"$f":"IF(O113=E42,J110,K110)","v":"14860-39540"},null,"Z.P.H.School",null,null,"MARCH",null,null,null,null,null,null,null,59,{"$f":"Z109+800","v":32350},{"$f":"AA109+850","v":33200},34050,59,{"$f":"AD109+800","v":31550},null,null,null,null,9,"2010-02-01","2010-08-01","2011-08-01","2012-08-01","00:00:00","00:00:00","00:00:00","00:00:00",null,null,null,null,null,null,null,null,null,null,null,null,null,59," FIFTY NINE ",null,{"$f":"BH109+800","v":32350},59,"2011-09-21","2008-08-28",null,null,"2012-04-06","2011-07-30T00:14:24","00:00:00",{"$f":"BILL!D36","v":0},40725.499999999993,{"$f":"BILL!Z36","v":0},{"$f":"BILL!X36","v":0},{"$f":"BILL!P36","v":0},{"$f":"BILL!N36","v":0},{"$f":"VLOOKUP(BN110,BR78:BV111,2,TRUE)","v":0},{"$f":"VLOOKUP(BN110,BR78:BV111,3,TRUE)","v":0},{"$f":"VLOOKUP(BN110,BR78:BV111,4,TRUE)","v":0},{"$f":"VLOOKUP(BN110,BR78:BV111,5,TRUE)","v":0}]
[null,null,null,null,null,{"$f":"IF(OR(F103=F104,F104>E135),0,F104)","v":"00:00:00"},null,0,0,{"$f":"IF(F111=E138,O78,J110)","v":"14860-39540"},{"$f":"IF(F110=E138,O78,J110)","v":"14860-39540"},{"$f":"IF(O113=E42,J111,K111)","v":"14860-39540"},null,"G.PRIMARY.School",null,null,"APRIL",null,null,null,null,null,null,null,60,{"$f":"Z110+850","v":33200},{"$f":"AA110+850","v":34050},34900,60,{"$f":"AD110+800","v":32350},null,null,null,null,10,"2010-02-01","2010-08-01","2011-08-01","2012-08-01","00:00:00","00:00:00","00:00:00","00:00:00",null,null,null,null,null,null,null,null,null,null,null,null,null,60," SIXTY ",null,{"$f":"BH110+850","v":33200},60,"2011-09-22","2008-08-29",null,null,"2012-04-07","2011-07-30T00:14:24","00:00:00",{"$f":"BILL!D37","v":0},40725.599999999991,{"$f":"BILL!Z37","v":0},{"$f":"BILL!X37","v":0},{"$f":"BILL!P37","v":0},{"$f":"BILL!N37","v":0},{"$f":"VLOOKUP(BN111,BR78:BV111,2,TRUE)","v":0},{"$f":"VLOOKUP(BN111,BR78:BV111,3,TRUE)","v":0},{"$f":"VLOOKUP(BN111,BR78:BV111,4,TRUE)","v":0},{"$f":"VLOOKUP(BN111,BR78:BV111,5,TRUE)","v":0}]
[null,null,null,null,null,{"$f":"IF(OR(F104=F105,F105>E135),0,F105)","v":"00:00:00"},null,0,0,{"$f":"IF(F112=E138,O78,J111)","v":"14860-39540"},{"$f":"IF(F111=E138,O78,J111)","v":"14860-39540"},{"$f":"IF(O113=E42,J112,K112)","v":"14860-39540"},null,"G.H.School","NEXT INCREMENT DATE",null,"MAY",null,null,null,null,null,null,null,61,{"$f":"Z111+850","v":34050},{"$f":"AA111+850","v":34900},35800,61,{"$f":"AD111+850","v":33200},null,null,null,null,null,null,null,null,null,null,null,null,null,null,null,null,null,null,null,null,null,null,null,null,null,null,61," SIXTY ONE ",null,{"$f":"BH111+850","v":34050},61,"2011-09-23","2008-08-30"]
[null,null,null,null,null,{"$f":"IF(OR(F105=F106,F106>E135),0,F106)","v":"00:00:00"},null,0,0,{"$f":"IF(F113=E138,O78,J112)","v":"14860-39540"},{"$f":"IF(F112=E138,O78,J112)","v":"14860-39540"},{"$f":"IF(O113=E42,J113,K113)","v":"14860-39540"},null,"10 &12","DATE OF PROMOTION",null,"JUNE",null,null,null,null,null,null,null,62,{"$f":"Z112+850","v":34900},{"$f":"AA112+900","v":35800},36700,62,{"$f":"AD112+850","v":34050},null,null,null,null,null,null,null,null,null,null,null,null,null,null,null,null,null,null,null,null,null,null,null,null,null,null,62," SIXTY TWO ",null,{"$f":"BH112+850","v":34900},62,"2011-09-24","2008-08-31"]
[null,null,null,null,null,{"$f":"IF(OR(F106=F107,F107>E135),0,F107)","v":"00:00:00"},null,0,0,{"$f":"IF(F114=E138,O78,J113)","v":"14860-39540"},{"$f":"IF(F113=E138,O78,J113)","v":"14860-39540"},{"$f":"IF(O113=E42,J114,K114)","v":"14860-39540"},null,"12.5&14.5",null,null,"JULY",null,null,null,null,null,null,null,63,{"$f":"Z113+900","v":35800},{"$f":"AA113+900","v":36700},37600,63,{"$f":"AD113+850","v":34900},null,null,null,null,null,null,null,null,null,null,null,null,null,null,null,null,null,null,null,null,null,null,null,null,null,null,63," SIXTY THREE ",null,{"$f":"BH113+900","v":35800},63,"2011-09-25","2008-09-01"]
[null,null,null,null,null,null,null,null,null,null,null,null,null,20,null,null,"AUGUST",null,null,null,null,null,null,null,64,{"$f":"Z114+900","v":36700},{"$f":"AA114+900","v":37600},38570,64,{"$f":"AD114+900","v":35800},null,null,null,null,null,null,null,null,null,null,null,null,null,null,null,null,null,null,null,null,null,null,null,null,null,null,64," SIXTY FOUR",null,{"$f":"BH114+900","v":36700},64,"2011-09-26","2008-09-02"]
[null,null,null,null,null,null,null,null,null,null,null,null,null,30,null,null,"SEPTEMBER",null,null,null,null,null,null,null,65,{"$f":"Z115+900","v":37600},{"$f":"AA115+970","v":38570},39540,65,{"$f":"AD115+900","v":36700},null,null,null,null,null,null,null,null,null,null,null,null,null,null,null,null,null,null,null,null,null,null,null,null,null,null,65," SIXTY FIVE",null,{"$f":"BH115+900","v":37600},65,"2011-09-27","2008-09-03"]
[null,null,null,null,null,null,null,null,null,null,null,null,null,null,null,null,"OCTOBER",null,null,null,null,null,null,null,66,{"$f":"Z116+970","v":38570},{"$f":"AA116+970","v":39540},40510,66,{"$f":"AD116+900","v":37600},null,null,null,null,null,null,null,null,null,null,null,null,null,null,null,null,null,null,null,null,null,null,null,null,null,null,66," SIXTY SIX ",null,{"$f":"BH116+970","v":38570},66,"2011-09-28","2008-09-04"]
[null,null,null,null,null,null,null,null,null,null,null,null,null,null,null,null,"NOVEMBER",null,null,null,null,null,null,null,67,{"$f":"Z117+970","v":39540},{"$f":"AA117+970","v":40510},41550,67,{"$f":"AD117+970","v":38570},null,null,null,null,null,null,null,null,null,null,null,null,null,null,null,null,null,null,null,null,null,null,null,null,null,null,67," SIXTY SEVEN ",null,{"$f":"BH117+970","v":39540},67,"2011-09-29","2008-09-05"]
[null,null,null,null,null,null,null,null,null,null,null,null,null,null,null,null,"DECEMBER",null,null,null,null,null,null,null,68,{"$f":"Z118+970","v":40510},{"$f":"AA118+1040","v":41550},42590,68,{"$f":"AD118+970","v":39540},null,null,null,null,null,null,null,null,null,null,null,null,null,null,null,null,null,null,null,null,null,null,null,null,null,null,68," SIXTY EIGHT ",null,{"$f":"BH118+970","v":40510},68,"2011-09-30","2008-09-06"]
[null,null,"zppf/g.p.f",null,{"$f":"IF(E9=\"Z.P.P.F.\",2,1)","v":2},null,null,null,null,null,null,null,null,null,null,null,null,null,null,null,null,null,null,null,69,{"$f":"Z119+1040","v":41550},{"$f":"AA119+1040","v":42590},43630,69,{"$f":"AD119+970","v":40510},null,null,null,null,null,null,null,null,null,null,null,null,null,null,null,null,null,null,null,null,null,null,null,null,null,null,69," SIXTY NINE ",null,{"$f":"BH119+1040","v":41550},69,"2011-10-01","2008-09-07"]
[null,null,"AGE EXEMPTION",null,{"$f":"IF(E13=\"YES\",1,0)","v":0},null,null,null,null,null,null,null,null,null,null,null,"H.M.",null,null,null,null,null,null,null,70,{"$f":"Z120+1040","v":42590},{"$f":"AA120+1040","v":43630},44740,70,{"$f":"AD120+1040","v":41550},null,null,null,null,null,null,null,null,null,null,null,null,null,null,null,null,null,null,null,null,null,null,null,null,null,null,70," SEVENTY ",null,{"$f":"BH120+1040","v":42590},70,"2011-10-02","2008-09-08"]
[null,null,null,null,{"$f":"ROUNDDOWN(E17/10000000000,0)","v":0},{"$f":"ROUNDDOWN((E17-E122*10000000000)/1000000000,0)","v":7},{"$f":"ROUNDDOWN((E17-E122*10000000000-F122*1000000000)/100000000,0)","v":0},{"$f":"ROUNDDOWN((E17-E122*10000000000-F122*1000000000-G122*100000000)/10000000,0)","v":5},{"$f":"ROUNDDOWN((E17-E122*10000000000-F122*1000000000-G122*100000000-H122*10000000)/1000000,0)","v":0},{"$f":"ROUNDDOWN((E17-E122*10000000000-F122*1000000000-G122*100000000-H122*10000000-I122*1000000)/100000,0)","v":3},{"$f":"ROUNDDOWN((E17-E122*10000000000-F122*1000000000-G122*100000000-H122*10000000-I122*1000000-J122*100000)/10000,0)","v":0},{"$f":"ROUNDDOWN((E17-E122*10000000000-F122*1000000000-G122*100000000-H122*10000000-I122*1000000-J122*100000-K122*10000)/1000,0)","v":8},{"$f":"ROUNDDOWN((E17-E122*10000000000-F122*1000000000-G122*100000000-H122*10000000-I122*1000000-J122*100000-K122*10000-L122*1000)/100,0)","v":0},{"$f":"ROUNDDOWN((E17-E122*10000000000-F122*1000000000-G122*100000000-H122*10000000-I122*1000000-J122*100000-K122*10000-L122*1000-M122*100)/10,0)","v":2},{"$f":"ROUNDDOWN((E17-E122*10000000000-F122*1000000000-G122*100000000-H122*10000000-I122*1000000-J122*100000-K122*10000-L122*1000-M122*100-N122*10),0)","v":6},null,"S.A.(M)",null,null,null,null,null,null,null,71,{"$f":"Z121+1040","v":43630},{"$f":"AA121+1110","v":44740},45850,71,{"$f":"AD121+1040","v":42590},null,null,null,null,null,null,null,null,null,null,null,null,null,null,null,null,null,null,null,null,null,null,null,null,null,null,71," SEVENTY ONE",null,{"$f":"BH121+1040","v":43630},71,"2011-10-03","2008-09-09"]
[null,null,null,null,{"$f":"IF(E23=O106,1,2)","v":2},null,null,null,null,null,null,null,null,null,null,null,"S.A.(P.S.)",null,null,null,null,null,null,null,72,{"$f":"Z122+1110","v":44740},{"$f":"AA122+1110","v":45850},46960,72,{"$f":"AD122+1040","v":43630},null,null,null,null,null,null,null,null,null,null,null,null,null,null,null,null,null,null,null,null,null,null,null,null,null,null,72," SEVENTY TWO",null,{"$f":"BH122+1110","v":44740},72,"2011-10-04","2008-09-10"]
[null,null,"TYPE SCHOOL",null,{"$f":"IF(OR(E30=N108,E30=N109),1,IF(E30=N110,2,IF(E30=N112,4,3)))","v":1},null,null,null,null,null,null,null,null,null,null,null,"S.A.(B.S.)",null,null,null,null,null,null,null,73,{"$f":"Z123+1110","v":45850},{"$f":"AA123+1110","v":46960},48160,73,{"$f":"AD123+1110","v":44740},null,null,null,null,null,null,null,null,null,null,null,null,null,null,null,null,null,null,null,null,null,null,null,null,null,null,73," SEVENTY THREE ",null,{"$f":"BH123+1110","v":45850},73,"2011-10-05","2008-09-11"]
[null,null,null,null,{"$f":"IF(E32=P106,1,2)","v":1},null,null,null,null,null,null,null,1,31,null,null,"S.A.(S.S.)",null,null,null,null,null,null,null,74,{"$f":"Z124+1110","v":46960},{"$f":"AA124+1200","v":48160},49360,74,{"$f":"AD124+1110","v":45850},null,null,null,null,null,null,null,null,null,null,null,null,null,null,null,null,null,null,null,null,null,null,null,null,null,null,74," SEVENTY FOUR ",null,{"$f":"BH124+1110","v":46960},74,"2011-10-06","2008-09-12"]
[null,null,null,null,{"$f":"IF(OR(E39=Q108,E39=Q109,E39=Q110,E39=Q111,E39=Q112,E39=Q113),IF(OR(E39=Q108,E39=Q109,E39=Q110),IF(E39=Q108,1,IF(E39=Q109,2,3)),IF(E39=Q111,4,IF(E39=Q112,5,6))),IF(OR(E39=Q114,E39=Q115,E39=Q116),IF(E39=Q114,7,IF(E39=Q115,8,9)),IF(E39=Q117,10,IF(E39=Q118,11,12))))","v":8},null,null,null,null,null,null,null,2,28,null,null,"S.A.(ENG)",null,null,null,null,null,null,null,75,{"$f":"Z125+1200","v":48160},{"$f":"AA125+1200","v":49360},50560,75,{"$f":"AD125+1110","v":46960},null,null,null,null,null,null,null,null,null,null,null,null,null,null,null,null,null,null,null,null,null,null,null,null,null,null,75," SEVENTY FIVE ",null,{"$f":"BH125+1200","v":48160},75,"2011-10-07","2008-09-13"]
[null,null,null,null,{"$f":"IF(E41=O106,1,2)","v":2},null,null,null,null,null,null,null,3,31,null,null,"S.A.(TEL)",null,null,null,null,null,null,null,76,{"$f":"Z126+1200","v":49360},{"$f":"AA126+1200","v":50560},51760,76,{"$f":"AD126+1200","v":48160},null,null,null,null,null,null,null,null,null,null,null,null,null,null,null,null,null,null,null,null,null,null,null,null,null,null,76," SEVENTY SIX ",null,{"$f":"BH126+1200","v":49360},76,"2011-10-08","2008-09-14"]
[null,null,null,null,{"$f":"IF(E42=O112,1,2)","v":2},null,null,null,null,null,null,null,4,30,null,null,"S.A.(HIN)",null,null,null,null,null,null,null,77,{"$f":"Z127+1200","v":50560},{"$f":"AA127+1200","v":51760},53060,77,{"$f":"AD127+1200","v":49360},null,null,null,null,null,null,null,null,null,null,null,null,null,null,null,null,null,null,null,null,null,null,null,null,null,null,77," SEVENTY SEVEN ",null,{"$f":"BH127+1200","v":50560},77,"2011-10-09","2008-09-15"]
[null,null,null,null,{"$f":"IF(#REF!=O106,1,2)","v":{"$error":"#REF!"}},null,null,null,null,null,null,null,5,31,null,null,"S.A.(            )",null,null,null,null,null,null,null,78,{"$f":"Z128+1200","v":51760},{"$f":"AA128+1300","v":53060},54360,78,{"$f":"AD128+1200","v":50560},null,null,null,null,null,null,null,null,null,null,null,null,null,null,null,null,null,null,null,null,null,null,null,null,null,null,78," SEVENTY EIGHT ",null,{"$f":"BH128+1200","v":51760},78,"2011-10-10","2008-09-16"]
[null,null,null,null,{"$f":"ROUNDDOWN(E19/1000,0)","v":3},{"$f":"ROUNDDOWN((E19-E130*1000)/100,0)","v":6},{"$f":"ROUNDDOWN((E19-(E130*1000+F130*100))/10,0)","v":4},{"$f":"(E19-E130*1000-F130*100-G130*10)","v":1},null,null,null,null,6,30,null,null,"S.G.T.",null,null,null,null,null,null,null,79,{"$f":"Z129+1300","v":53060},54360,55660,79,{"$f":"AD129+1200","v":51760},null,null,null,null,null,{"$f":"'47-FRONT'!A65","v":1195},null,null," UNDER RUPEES :",null," ONLY",null,null,null,null,null,null,null,null,null,null,null,null,null,null,null,79," SEVENTY NINE",null,{"$f":"BH129+1300","v":53060},79,"2011-10-11","2008-09-17"]
[null,null,"ALWANCES",null,{"$f":"IF(#REF!=P87,0,IF(#REF!=P88,1,IF(#REF!=P89,2,IF(#REF!=P90,3,IF(#REF!=P91,4,5)))))","v":{"$error":"#REF!"}},{"$f":"IF(#REF!=P87,0,IF(#REF!=P88,1,IF(#REF!=P89,2,IF(#REF!=P90,3,IF(#REF!=P91,4,5)))))","v":{"$error":"#REF!"}},{"$f":"IF(#REF!=P87,0,IF(#REF!=P88,1,IF(#REF!=P89,2,IF(#REF!=P90,3,IF(#REF!=P91,4,5)))))","v":{"$error":"#REF!"}},{"$f":"IF(OR(#REF!=P92,#REF!=P92,#REF!=P92),1,IF(OR(#REF!=P93,#REF!=P93,#REF!=P93),2,3))","v":{"$error":"#REF!"}},null,null,null,null,7,31,null,null,"Gr.II(TEL)",null,null,null,null,null,null,null,80,54360,55660,56960,80,{"$f":"AD130+1300","v":53060},null,null,null,null,null,{"$f":"ROUNDDOWN(AJ130/100000,0)","v":0},{"$f":"IF(AJ131=0,T(AJ131),VLOOKUP(AJ131,BE52:BF150,2,TRUE))","v":""},null,null,{"$f":"IF(AJ131=0,T(AJ131),IF(AND(AJ132=0,AJ133=0,AJ134=0,AJ131<>1),\" LAKHS\",\" LAKH\"))","v":""},null,null,null,null,null,null,null,null,null,null,null,null,null,null,null,null,80," EIGHTY ",null,54360,80,"2011-10-12","2008-09-18"]
[null,null,null,null,{"$f":"IF(#REF!=AH52,AG52,IF(#REF!=AH53,AG53,IF(#REF!=AH54,AG54,IF(#REF!=AH55,AG55,IF(#REF!=AH56,AG56,IF(#REF!=AH57,AG57,AG58))))))","v":{"$error":"#REF!"}},{"$f":"VLOOKUP(E132,AG52:AM58,7,TRUE)","v":{"$error":"#REF!"}},null,null,null,null,null,null,8,31,null,null,"Gr.II(HIN)",null,null,null,null,null,null,null,81,55660,56960,58260,81,54360,null,null,null,null,null,{"$f":"ROUNDDOWN((AJ130-AJ131*100000)/1000,0)","v":1},{"$f":"IF(AJ132=0,T(AJ132),VLOOKUP(AJ132,BE49:BF143,2,TRUE))","v":" ONE"},null,null,{"$f":"IF(AJ132=0,T(AJ132),IF(AND(AJ133=0,AJ134=0,AJ132<>1),\" THOUSANDS\",\" THOUSAND\"))","v":" THOUSAND"},null,null,null,null,null,null,null,null,null,null,null,null,null,null,null,null,81," EIGHTY ONE ",null,55660,81,"2011-10-13","2008-09-19"]
[null,null,null,null,{"$f":"IF(E45=AH52,AG52,IF(E45=AH53,AG53,IF(E45=AH54,AG54,IF(E45=AH55,AG55,IF(E45=AH56,AG56,IF(E45=AH57,AG57,AG58))))))","v":10845},null,null,null,null,null,null,null,9,30,null,null,"P.E.T.(     )",null,null,null,null,null,null,null,82,56960,58260,59560,82,55660,null,null,null,null,null,{"$f":"ROUNDDOWN((AJ130-AJ131*100000-AJ132*1000)/100,0)","v":1},{"$f":"IF(AJ133=0,T(AJ133),VLOOKUP(AJ133,BE49:BF143,2,TRUE))","v":" ONE"},null,null,{"$f":"IF(AJ133=0,T(AJ133),IF(AND(AJ134=0,AJ133<>1),\" HUNDREDS\",\" HUNDRED\"))","v":" HUNDRED"},null,null,null,null,null,null,null,null,null,null,null,null,null,null,null,null,82," EIGHTY TWO ",null,56960,82,"2011-10-14","2008-09-20"]
[null,null,null,null,{"$f":"DATE(G28,F134,E28)","v":"1997-08-06"},{"$f":"IF(OR(F28=Q108,F28=Q109,F28=Q110,F28=Q111,F28=Q112,F28=Q113),IF(OR(F28=Q108,F28=Q109,F28=Q110),IF(F28=Q108,1,IF(F28=Q109,2,3)),IF(F28=Q111,4,IF(F28=Q112,5,6))),IF(OR(F28=Q114,F28=Q115,F28=Q116),IF(F28=Q114,7,IF(F28=Q115,8,9)),IF(F28=Q117,10,IF(F28=Q118,11,12))))","v":8},null,null,null,null,null,null,10,31,null,null,"Gr.II(CRAFT)",null,null,null,null,null,null,null,83,58260,59560,60860,83,56960,null,null,null,null,null,{"$f":"AJ130-AJ131*100000-AJ132*1000-AJ133*100","v":95},{"$f":"IF(AJ134=0,T(AJ134),VLOOKUP(AJ134,BE49:BF143,2,TRUE))","v":" NINETY TWO"},null,null,{"$f":"IF(OR(AJ134=0,AND(AJ131=0,AJ132=0,AJ133=0)),T(AJ134),\" AND\")","v":" AND"},null,null,null,null,null,null,null,null,null,null,null,null,null,null,null,null,83," EIGHTY THREE ",null,58260,83,"2011-10-15","2008-09-21"]
[null,null,null,null,{"$f":"DATE(G29,F135,E29)+0.01","v":"2011-07-30T00:14:24"},{"$f":"IF(OR(F29=Q108,F29=Q109,F29=Q110,F29=Q111,F29=Q112,F29=Q113),IF(OR(F29=Q108,F29=Q109,F29=Q110),IF(F29=Q108,1,IF(F29=Q109,2,3)),IF(F29=Q111,4,IF(F29=Q112,5,6))),IF(OR(F29=Q114,F29=Q115,F29=Q116),IF(F29=Q114,7,IF(F29=Q115,8,9)),IF(F29=Q117,10,IF(F29=Q118,11,12))))","v":7},null,null,null,null,null,null,11,30,null,null,"P.D",null,null,null,null,null,null,null,84,59560,60860,60860,84,58260,null,null,null,null,null,{"$f":"IF(AJ130=0,\"RUPEES ZERO ONLY\",CONCATENATE(AM130,AK131,AN131,AK132,AN132,AK133,AN133,AN134,AK134,AO130))","v":" UNDER RUPEES : ONE THOUSAND ONE HUNDRED AND NINETY TWO ONLY"},null,null,null,null,null,null,null,null,null,null,null,null,null,"2010-02-01",null,null,null,null,null,null,84," EIGHTY FOUR ",null,59560,84,"2011-10-16","2008-09-22"]
[null,null,null,null,{"$f":"DATE(G38,F136,E38)+0.001","v":"2010-04-01T00:01:26.400"},{"$f":"IF(OR(F38=Q108,F38=Q109,F38=Q110,F38=Q111,F38=Q112,F38=Q113),IF(OR(F38=Q108,F38=Q109,F38=Q110),IF(F38=Q108,1,IF(F38=Q109,2,3)),IF(F38=Q111,4,IF(F38=Q112,5,6))),IF(OR(F38=Q114,F38=Q115,F38=Q116),IF(F38=Q114,7,IF(F38=Q115,8,9)),IF(F38=Q117,10,IF(F38=Q118,11,12))))","v":4},null,null,null,null,null,null,12,31,null,null,"L.F.L.(H.M.)",null,null,null,null,null,null,null,null,null,null,null,null,59560,null,null,null,null,null,null,null,null,null,null,null,null,null,null,null,null,null,null,null,null,null,null,null,null,null,null,85," EIGHTY FIVE ",null,null,null,"2011-10-17","2008-09-23"]
[null,null,null,null,{"$f":"DATE(#REF!,F137,#REF!)+0.01","v":{"$error":"#REF!"}},{"$f":"IF(OR(#REF!=Q108,#REF!=Q109,#REF!=Q110,#REF!=Q111,#REF!=Q112,#REF!=Q113),IF(OR(#REF!=Q108,#REF!=Q109,#REF!=Q110),IF(#REF!=Q108,1,IF(#REF!=Q109,2,3)),IF(#REF!=Q111,4,IF(#REF!=Q112,5,6))),IF(OR(#REF!=Q114,#REF!=Q115,#REF!=Q116),IF(#REF!=Q114,7,IF(#REF!=Q115,8,9)),IF(#REF!=Q117,10,IF(#REF!=Q118,11,12))))","v":{"$error":"#REF!"}},null,null,null,null,null,null,null,null,null,null,"Gr.II(DRAW)",null,null,null,null,null,null,null,null,null,null,null,null,null,null,null,null,null,null,{"$f":"'47-FRONT'!H57","v":1194},null,null,"RUPEES :",null," ONLY",null,null,null,null,null,null,null,null,null,null,null,null,null,null,null,86," EIGHTY SIX ",null,null,null,"2011-10-18","2008-09-24"]
[null,null,null,null,{"$f":"DATE(G43,F138,E43)+0.01","v":"1900-11-30T00:14:24"},{"$f":"IF(OR(F43=Q108,F43=Q109,F43=Q110,F43=Q111,F43=Q112,F43=Q113),IF(OR(F43=Q108,F43=Q109,F43=Q110),IF(F43=Q108,1,IF(F43=Q109,2,3)),IF(F43=Q111,4,IF(F43=Q112,5,6))),IF(OR(F43=Q114,F43=Q115,F43=Q116),IF(F43=Q114,7,IF(F43=Q115,8,9)),IF(F43=Q117,10,IF(F43=Q118,11,12))))","v":12},null,null,null,null,null,null,null,null,null,null,null,null,null,null,null,null,null,null,null,null,null,null,null,null,null,null,null,null,null,{"$f":"ROUNDDOWN(AJ137/100000,0)","v":0},{"$f":"IF(AJ138=0,T(AJ138),VLOOKUP(AJ138,BE52:BF150,2,TRUE))","v":""},null,null,{"$f":"IF(AJ138=0,T(AJ138),IF(AND(AJ139=0,AJ140=0,AJ141=0,AJ138<>1),\" LAKHS\",\" LAKH\"))","v":""},null,null,null,null,null,null,null,null,null,null,null,null,null,null,null,null,87," EIGHTY SEVEN ",null,null,null,"2011-10-19","2008-09-25"]
[null,null,null,null,null,null,null,null,null,null,null,null,null,null,null,null,null,null,null,null,null,null,null,null,null,null,null,null,null,null,null,null,null,null,null,{"$f":"ROUNDDOWN((AJ137-AJ138*100000)/1000,0)","v":1},{"$f":"IF(AJ139=0,T(AJ139),VLOOKUP(AJ139,BE52:BF150,2,TRUE))","v":" ONE"},null,null,{"$f":"IF(AJ139=0,T(AJ139),IF(AND(AJ140=0,AJ141=0,AJ139<>1),\" THOUSANDS\",\" THOUSAND\"))","v":" THOUSAND"},null,null,null,null,null,null,null,null,null,null,null,null,null,null,null,null,88," EIGHTY EIGHT ",null,null,null,"2011-10-20","2008-09-26"]
[null,null,null,null,null,null,null,null,null,null,null,null,null,null,null,null,null,null,null,null,null,null,null,null,null,null,null,null,null,null,null,null,null,null,null,{"$f":"ROUNDDOWN((AJ137-AJ138*100000-AJ139*1000)/100,0)","v":1},{"$f":"IF(AJ140=0,T(AJ140),VLOOKUP(AJ140,BE52:BF150,2,TRUE))","v":" ONE"},null,null,{"$f":"IF(AJ140=0,T(AJ140),IF(AND(AJ141=0,AJ140<>1),\" HUNDREDS\",\" HUNDRED\"))","v":" HUNDRED"},null,null,null,null,null,null,null,null,null,null,null,null,null,null,null,null,89," EIGHTY NINE ",null,null,null,"2011-10-21","2008-09-27"]
[null,null,null,null,null,null,null,null,null,null,null,null,null,null,null,null,null,null,null,null,null,null,null,null,null,null,null,null,null,null,null,null,null,null,null,{"$f":"AJ137-AJ138*100000-AJ139*1000-AJ140*100","v":94},{"$f":"IF(AJ141=0,T(AJ141),VLOOKUP(AJ141,BE52:BF150,2,TRUE))","v":" NINETY FOUR "},null,null,{"$f":"IF(OR(AJ141=0,AND(AJ138=0,AJ139=0,AJ140=0)),T(AJ141),\" AND\")","v":" AND"},null,null,null,null,null,null,null,null,null,null,null,null,null,null,null,null,90," NINETY ",null,null,null,"2011-10-22","2008-09-28"]
[null,null,null,null,{"$f":"DATE(YEAR(BILL!D5),MONTH(BILL!D5),1)","v":"2010-02-01"},null,null,null,null,null,null,null,null,null,null,null,null,null,0,{"$f":"E64","v":"00:00:00"},{"$f":"E65","v":"2011-07-31T00:14:24"},{"$f":"E66","v":"2011-07-31T00:14:24"},{"$f":"G64","v":41492},null,null,null,null,null,null,null,null,null,null,null,null,{"$f":"IF(AJ137=0,\"RUPEES ZERO ONLY\",CONCATENATE(AM137,AK138,AN138,AK139,AN139,AK140,AN140,AN141,AK141,AO137))","v":"RUPEES : ONE THOUSAND ONE HUNDRED AND NINETY FOUR  ONLY"},null,null,null,null,null,null,null,null,null,null,null,null,null,null,null,null,null,null,null,null,91," NINETY ONE ",null,null,null,"2011-10-23","2008-09-29"]
[null,null,null,null,{"$f":"DATE(IF(MONTH(E142=12),YEAR(E142)+1,YEAR(E142)),MONTH(E142)+1,1)","v":"2011-03-01"},null,null,null,null,null,null,null,null,null,null,null,null,null,1,{"$f":"E72","v":"2010-08-01"},{"$f":"E73","v":"2011-08-01"},{"$f":"E74","v":"2012-08-01"},{"$f":"H72","v":14860},null,null,null,null,null,null,null,null,null,null,null,null,null,null,null,null,null,null,null,null,null,null,null,null,null,null,null,null,null,null,null,null,null,92," NINETY TWO",null,null,null,"2011-10-24","2008-09-30"]
[null,null,null,null,{"$f":"DATE(IF(MONTH(E143=12),YEAR(E143)=1,YEAR(E143)),MONTH(E143)+1,1)","v":"1900-04-01"},null,null,null,null,null,null,null,null,null,null,null,null,null,9,{"$f":"E77","v":"2010-08-01"},{"$f":"E78","v":"2010-02-01"},{"$f":"E79","v":"00:00:00"},{"$f":"K76","v":0},null,null,null,null,null,null,null,null,null,null,null,null,{"$f":"'47-FRONT'!T48","v":9004},null,null,"RUPEES :",null," ONLY",null,null,null,null,null,null,null,null,null,null,null,null,null,null,null,93," NINETY THREE ",null,null,null,"2011-10-25","2008-10-01"]
[null,null,null,null,"1900-05-01",null,null,null,null,null,null,null,null,null,null,null,null,null,null,null,null,null,null,null,null,null,null,null,null,null,null,null,null,null,null,{"$f":"ROUNDDOWN(AJ144/100000,0)","v":0},{"$f":"IF(AJ145=0,T(AJ145),VLOOKUP(AJ145,BE52:BF150,2,TRUE))","v":""},null,null,{"$f":"IF(AJ145=0,T(AJ145),IF(AND(AJ146=0,AJ147=0,AJ148=0,AJ145<>1),\" LAKHS\",\" LAKH\"))","v":""},null,null,null,null,null,null,null,null,null,null,null,null,null,null,null,null,94," NINETY FOUR ",null,null,null,"2011-10-26","2008-10-02"]
[null,null,null,null,"1900-06-01",null,null,null,null,null,null,null,null,null,null,null,null,null,null,null,null,null,null,null,null,null,null,{"$f":"MAX(D72,D76*(N81))","v":0},null,null,null,null,null,null,null,{"$f":"ROUNDDOWN((AJ144-AJ145*100000)/1000,0)","v":9},{"$f":"IF(AJ146=0,T(AJ146),VLOOKUP(AJ146,BE52:BF150,2,TRUE))","v":" NINE "},null,null,{"$f":"IF(AJ146=0,T(AJ146),IF(AND(AJ147=0,AJ148=0,AJ146<>1),\" THOUSANDS\",\" THOUSAND\"))","v":" THOUSAND"},null,null,null,null,null,null,null,null,null,null,null,null,null,null,null,null,95," NINETY FIVE ",null,null,null,"2011-10-27","2008-10-03"]
[null,null,null,null,"1900-07-01",null,null,null,null,null,null,null,null,null,null,null,null,null,null,null,null,null,null,null,null,null,null,0,null,null,null,null,null,null,null,{"$f":"ROUNDDOWN((AJ144-AJ145*100000-AJ146*1000)/100,0)","v":0},{"$f":"IF(AJ147=0,T(AJ147),VLOOKUP(AJ147,BE52:BF150,2,TRUE))","v":""},null,null,{"$f":"IF(AJ147=0,T(AJ147),IF(AND(AJ148=0,AJ147<>1),\" HUNDREDS\",\" HUNDRED\"))","v":""},null,null,null,null,null,null,null,null,null,null,null,null,null,null,null,null,96," NINETY SIX",null,null,null,"2011-10-28","2008-10-04"]
[null,null,null,null,"1900-08-01",null,null,null,null,null,null,null,0,"Monitory benefit from","2010-02-01",null,null,null,0,{"$f":"E64","v":"00:00:00"},{"$f":"E65","v":"2011-07-31T00:14:24"},{"$f":"E66","v":"2011-07-31T00:14:24"},{"$f":"K64","v":0},{"$f":"K65","v":0},{"$f":"K66","v":0},null,null,1,{"$f":"IF(AND(E137+1461*2>Q68,E137+1461*2<=Q69),\"S.G\",IF(AND(E137+1461*4>Q68,E137+1461*4<=Q69),\"S.P.P - I / S.A.P.P - I\",\"S.P.P - II /  S.A.P.P - II\"))","v":{"$error":"#REF!"}},null,{"$f":"C72","v":"increment date"},null,{"$f":"VLOOKUP(AE148,E71:I73,4,TRUE)","v":{"$error":"#N/A"}},null,null,{"$f":"AJ144-AJ145*100000-AJ146*1000-AJ147*100","v":4},{"$f":"IF(AJ148=0,T(AJ148),VLOOKUP(AJ148,BE52:BF150,2,TRUE))","v":" FOUR "},null,null,{"$f":"IF(OR(AJ148=0,AND(AJ145=0,AJ146=0,AJ147=0)),T(AJ148),\" AND\")","v":" AND"},null,null,null,null,null,null,null,null,null,null,null,null,null,null,null,null,97," NINETY SEVEN ",null,null,null,"2011-10-29","2008-10-05"]
[null,null,null,null,"1900-09-01",null,null,null,null,null,null,null,1,"Automatic Advancement increments on",{"$f":"C72","v":"increment date"},"He/She has S.G./S.PP-1/S.P.P-II/S.A.PP.-1/S.A.P.P.-II increments on",null,null,1,{"$f":"E72","v":"2010-08-01"},{"$f":"E73","v":"2011-08-01"},{"$f":"E74","v":"2012-08-01"},{"$f":"K71","v":0},{"$f":"K72","v":"AAS GRADE"},{"$f":"K73","v":0},null,null,9,{"$f":"IF(O141<E138,\"F.R.31(II)\",\"F.R.22 a (1)\")","v":"F.R.31(II)"},{"$f":"IF(O141<E138,\" \",\"F.R.22 B\")","v":" "},{"$f":"C77","v":"00:00:00"},{"$f":"VLOOKUP(AE149+366,E65:E68,1,TRUE)","v":{"$error":"#N/A"}},{"$f":"VLOOKUP(AE149,E76:M78,7,TRUE)","v":{"$error":"#N/A"}},{"$f":"VLOOKUP(AG149,Z52:AB135,3,TRUE)","v":{"$error":"#N/A"}},null,{"$f":"IF(AJ144=0,\"RUPEES ZERO ONLY\",CONCATENATE(AM144,AK145,AN145,AK146,AN146,AK147,AN147,AN148,AK148,AO144))","v":"RUPEES : NINE  THOUSAND AND FOUR  ONLY"},null,null,null,null,null,null,null,null,null,null,null,null,null,null,null,null,null,null,null,null,98," NINETY EIGHT ",null,null,null,"2011-10-30","2008-10-06"]
[null,null,null,null,"1900-10-01",null,null,null,null,null,null,null,9,{"$f":"CONCATENATE(\"He/She has got promotion to \",E44,\" post on\")","v":"He/She has got promotion to  post on"},{"$f":"C77","v":"00:00:00"},{"$f":"N150","v":"He/She has got promotion to  post on"},null,null,9,{"$f":"E83","v":"2011-08-01"},{"$f":"E84","v":"2012-08-01"},{"$f":"E85","v":"2010-08-01"},{"$f":"K82","v":0},{"$f":"K83","v":0},{"$f":"K84","v":0},null,null,18,"F.R.22 B",null,{"$f":"AE149","v":"00:00:00"},null,{"$f":"VLOOKUP(AE150,E76:M78,7,TRUE)","v":{"$error":"#N/A"}},null,null,{"$f":"'PT SCHEDULE'!I30","v":-50},null,null,"RUPEES :",null," ONLY",null,null,null,null,null,null,null,null,null,null,null,null,null,null,null,99," NINETY NINE",null,null,null,"2011-10-31","2008-10-07"]
[null,null,null,null,"1900-11-01",null,null,null,null,null,null,null,null,null,null,null,null,null,null,null,null,null,null,null,null,null,null,null,null,null,null,null,null,null,null,{"$f":"ROUNDDOWN(AJ150/100000,0)","v":0},{"$f":"IF(AJ151=0,T(AJ151),VLOOKUP(AJ151,BE52:BF150,2,TRUE))","v":""},null,null,{"$f":"IF(AJ151=0,T(AJ151),IF(AND(AJ152=0,AJ153=0,AJ154=0,AJ151<>1),\" LAKHS\",\" LAKH\"))","v":""},null,null,null,null,null,null,null,null,null,null,null,null,null,null,null,null,null,null,null,null,null,"2011-11-01","2008-10-08"]
[null,null,null,null,"1900-12-01",null,null,null,null,null,null,null,null,null,null,null,null,null,null,null,null,null,null,null,null,null,null,null,null,null,null,null,null,null,null,{"$f":"ROUNDDOWN((AJ150-AJ151*100000)/1000,0)","v":0},{"$f":"IF(AJ152=0,T(AJ152),VLOOKUP(AJ152,BE52:BF150,2,TRUE))","v":""},null,null,{"$f":"IF(AJ152=0,T(AJ152),IF(AND(AJ153=0,AJ154=0,AJ152<>1),\" THOUSANDS\",\" THOUSAND\"))","v":""},null,null,null,null,null,null,null,null,null,null,null,null,null,null,null,null,null,null,null,null,null,"2011-11-02","2008-10-09"]
[null,null,null,null,"1901-01-01",null,null,null,null,null,null,null,null,null,null,null,null,null,null,null,null,null,null,null,null,null,null,null,null,null,null,null,null,null,null,{"$f":"ROUNDDOWN((AJ150-AJ151*100000-AJ152*1000)/100,0)","v":0},{"$f":"IF(AJ153=0,T(AJ153),VLOOKUP(AJ153,BE52:BF150,2,TRUE))","v":""},null,null,{"$f":"IF(AJ153=0,T(AJ153),IF(AND(AJ154=0,AJ153<>1),\" HUNDREDS\",\" HUNDRED\"))","v":""},null,null,null,null,null,null,null,null,null,null,null,null,null,null,null,null,null,null,null,null,null,"2011-11-03","2008-10-10"]
[null,null,null,null,"1900-02-01",null,null,null,null,null,null,null,null,null,null,null,null,null,null,null,null,null,null,null,null,null,null,null,null,null,null,null,null,null,null,{"$f":"AJ150-AJ151*100000-AJ152*1000-AJ153*100","v":-50},{"$f":"IF(AJ154=0,T(AJ154),VLOOKUP(AJ154,BE52:BF150,2,TRUE))","v":{"$error":"#N/A"}},null,null,{"$f":"IF(OR(AJ154=0,AND(AJ151=0,AJ152=0,AJ153=0)),T(AJ154),\" AND\")","v":""},null,null,null,null,null,null,null,null,null,null,null,null,null,null,null,null,null,null,null,null,null,"2011-11-04","2008-10-11"]
[null,null,null,null,"1900-03-01",null,null,null,null,null,null,null,null,null,null,null,null,null,null,null,null,null,null,null,null,null,null,null,null,null,null,null,null,null,null,{"$f":"IF(AJ150=0,\"RUPEES ZERO ONLY\",CONCATENATE(AM150,AK151,AN151,AK152,AN152,AK153,AN153,AN154,AK154,AO150))","v":{"$error":"#N/A"}},null,null,null,null,null,null,null,null,null,null,null,null,null,null,null,null,null,null,null,null,null,null,null,null,null,"2011-11-05","2008-10-12"]
[null,null,null,null,"1900-04-01",null,null,null,null,null,null,null,null,null,null,null,null,null,null,{"$f":"IF(U156<=AM156,U156,AM156)","v":"2010-02-01"},"2010-02-01",{"$f":"IF(T156=C173,\" \",T156)","v":"2010-02-01"},{"$f":"IF(V156=C172,\" \",V156)","v":"2010-02-01"},{"$f":"IF(W156=C171,\" \",W156)","v":"2010-02-01"},{"$f":"IF(X156=C170,\" \",X156)","v":"2010-02-01"},{"$f":"IF(Y156=C169,\" \",Y156)","v":"2010-02-01"},{"$f":"IF(Z156=C168,\" \",Z156)","v":"2010-02-01"},{"$f":"IF(AA156=C167,\" \",AA156)","v":"2010-02-01"},{"$f":"IF(AB156=C166,\" \",AB156)","v":"2010-02-01"},{"$f":"IF(AC156=C165,\" \",AC156)","v":"2010-02-01"},{"$f":"IF(AD156=C164,\" \",AD156)","v":"2010-02-01"},{"$f":"IF(C163=AE156,\" \",AE156)","v":"2010-02-01"},{"$f":"IF(C162=AF156,\" \",AF156)","v":"2010-02-01"},{"$f":"IF(C161=AG156,\" \",AG156)","v":"2010-02-01"},{"$f":"IF(AH156=C160,\" \",AH156)","v":"2010-02-01"},{"$f":"IF(AI156=C159,\" \",AI156)","v":"2010-02-01"},{"$f":"IF(AJ156=C158,\" \",AJ156)","v":"2010-02-01"},{"$f":"IF(AK156=C157,\" \",AK156)","v":"2010-02-01"},{"$f":"E135+1","v":"2011-07-31T00:14:24"},1,"JANUARY",1972,null,null,null,null,null,null,null,null,null,null,null,null,null,null,null,null,null,null,null,"2011-11-06","2008-10-13"]
[null,null,null,null,"1900-05-01",null,null,null,null,null,null,null,null,null,null,null,null,null,null,{"$f":"IF(U157<=AM157,U157,AM157)","v":"2010-07-01"},"2010-07-01",{"$f":"IF(T157=C173,\" \",T157)","v":"2010-07-01"},{"$f":"IF(V157=C172,\" \",V157)","v":"2010-07-01"},{"$f":"IF(W157=C171,\" \",W157)","v":"2010-07-01"},{"$f":"IF(X157=C170,\" \",X157)","v":"2010-07-01"},{"$f":"IF(Y157=C169,\" \",Y157)","v":"2010-07-01"},{"$f":"IF(Z157=C168,\" \",Z157)","v":"2010-07-01"},{"$f":"IF(AA157=C167,\" \",AA157)","v":"2010-07-01"},{"$f":"IF(AB157=C166,\" \",AB157)","v":"2010-07-01"},{"$f":"IF(AC157=C165,\" \",AC157)","v":"2010-07-01"},{"$f":"IF(AD157=C164,\" \",AD157)","v":"2010-07-01"},{"$f":"IF(C163=AE157,\" \",AE157)","v":"2010-07-01"},{"$f":"IF(C162=AF157,\" \",AF157)","v":"2010-07-01"},{"$f":"IF(C161=AG157,\" \",AG157)","v":"2010-07-01"},{"$f":"IF(AH157=C160,\" \",AH157)","v":"2010-07-01"},{"$f":"IF(AI157=C159,\" \",AI157)","v":"2010-07-01"},{"$f":"IF(AJ157=C158,\" \",AJ157)","v":"2010-07-01"},{"$f":"IF(AK157=C157,\" \",AK157)","v":"2010-07-01"},{"$f":"AM156","v":"2011-07-31T00:14:24"},2,"FEBRUARY",1973,null,null,null,null,null,null,null,null,null,null,null,null,null,null,null,null,null,null,null,"2011-11-07","2008-10-14"]
[null,null,null,null,"1900-06-01",null,null,null,null,null,null,null,null,null,null,null,null,null,null,"2011-01-01","2011-01-01",{"$f":"IF(T158=C173,\" \",T158)","v":"2011-01-01"},{"$f":"IF(V158=C172,\" \",V158)","v":"2011-01-01"},{"$f":"IF(W158=C171,\" \",W158)","v":"2011-01-01"},{"$f":"IF(X158=C170,\" \",X158)","v":"2011-01-01"},{"$f":"IF(Y158=C169,\" \",Y158)","v":"2011-01-01"},{"$f":"IF(Z158=C168,\" \",Z158)","v":"2011-01-01"},{"$f":"IF(AA158=C167,\" \",AA158)","v":"2011-01-01"},{"$f":"IF(AB158=C166,\" \",AB158)","v":"2011-01-01"},{"$f":"IF(AC158=C165,\" \",AC158)","v":"2011-01-01"},{"$f":"IF(AD158=C164,\" \",AD158)","v":"2011-01-01"},{"$f":"IF(C163=AE158,\" \",AE158)","v":"2011-01-01"},{"$f":"IF(C162=AF158,\" \",AF158)","v":"2011-01-01"},{"$f":"IF(C161=AG158,\" \",AG158)","v":"2011-01-01"},{"$f":"IF(AH158=C160,\" \",AH158)","v":"2011-01-01"},{"$f":"IF(AI158=C159,\" \",AI158)","v":"2011-01-01"},{"$f":"IF(AJ158=C158,\" \",AJ158)","v":"2011-01-01"},{"$f":"IF(AK158=C157,\" \",AK158)","v":"2011-01-01"},{"$f":"AM157","v":"2011-07-31T00:14:24"},3,"MARCH",1974,null,null,null,null,null,null,null,null,null,null,null,null,null,null,null,null,null,null,null,"2011-11-08","2008-10-15"]
[null,null,null,null,"1900-07-01",null,null,null,null,null,null,null,null,null,null,null,null,null,null,"2011-07-31T00:14:24",{"$f":"E65","v":"2011-07-31T00:14:24"},{"$f":"IF(T159=C173,\" \",T159)","v":"2011-07-31T00:14:24"},{"$f":"IF(V159=C172,\" \",V159)","v":"2011-07-31T00:14:24"},{"$f":"IF(W159=C171,\" \",W159)","v":"2011-07-31T00:14:24"},{"$f":"IF(X159=C170,\" \",X159)","v":"2011-07-31T00:14:24"},{"$f":"IF(Y159=C169,\" \",Y159)","v":"2011-07-31T00:14:24"},{"$f":"IF(Z159=C168,\" \",Z159)","v":"2011-07-31T00:14:24"},{"$f":"IF(AA159=C167,\" \",AA159)","v":"2011-07-31T00:14:24"},{"$f":"IF(AB159=C166,\" \",AB159)","v":"2011-07-31T00:14:24"},{"$f":"IF(AC159=C165,\" \",AC159)","v":"2011-07-31T00:14:24"},{"$f":"IF(AD159=C164,\" \",AD159)","v":"2011-07-31T00:14:24"},{"$f":"IF(C163=AE159,\" \",AE159)","v":"2011-07-31T00:14:24"},{"$f":"IF(C162=AF159,\" \",AF159)","v":"2011-07-31T00:14:24"},{"$f":"IF(C161=AG159,\" \",AG159)","v":"2011-07-31T00:14:24"},{"$f":"IF(AH159=C160,\" \",AH159)","v":"2011-07-31T00:14:24"},{"$f":"IF(AI159=C159,\" \",AI159)","v":"2011-07-31T00:14:24"},{"$f":"IF(AJ159=C158,\" \",AJ159)","v":"2011-07-31T00:14:24"},{"$f":"IF(AK159=C157,\" \",AK159)","v":"2011-07-31T00:14:24"},"2011-07-31T00:14:24",4,"APRIL",1975,null,null,null,null,null,null,null,null,null,null,null,null,null,null,null,null,null,null,null,"2011-11-09","2008-10-16"]
[null,null,null,null,"1900-08-01",null,null,null,null,null,null,null,null,null,null,null,null,null,null,"2011-07-31T00:14:24",{"$f":"E135+1","v":"2011-07-31T00:14:24"},{"$f":"IF(T160=C173,\" \",T160)","v":"2011-07-31T00:14:24"},{"$f":"IF(V160=C172,\" \",V160)","v":"2011-07-31T00:14:24"},{"$f":"IF(W160=C171,\" \",W160)","v":"2011-07-31T00:14:24"},{"$f":"IF(X160=C170,\" \",X160)","v":"2011-07-31T00:14:24"},{"$f":"IF(Y160=C169,\" \",Y160)","v":"2011-07-31T00:14:24"},{"$f":"IF(Z160=C168,\" \",Z160)","v":"2011-07-31T00:14:24"},{"$f":"IF(AA160=C167,\" \",AA160)","v":"2011-07-31T00:14:24"},{"$f":"IF(AB160=C166,\" \",AB160)","v":"2011-07-31T00:14:24"},{"$f":"IF(AC160=C165,\" \",AC160)","v":"2011-07-31T00:14:24"},{"$f":"IF(AD160=C164,\" \",AD160)","v":"2011-07-31T00:14:24"},{"$f":"IF(C163=AE160,\" \",AE160)","v":"2011-07-31T00:14:24"},{"$f":"IF(C162=AF160,\" \",AF160)","v":"2011-07-31T00:14:24"},{"$f":"IF(C161=AG160,\" \",AG160)","v":"2011-07-31T00:14:24"},{"$f":"IF(AH160=C160,\" \",AH160)","v":"2011-07-31T00:14:24"},{"$f":"IF(AI160=C159,\" \",AI160)","v":"2011-07-31T00:14:24"},{"$f":"IF(AJ160=C158,\" \",AJ160)","v":"2011-07-31T00:14:24"},{"$f":"IF(AK160=C157,\" \",AK160)","v":"2011-07-31T00:14:24"},"2011-07-31T00:14:24",5,"MAY",1976,null,null,null,null,null,null,null,null,null,null,null,null,null,null,null,null,null,null,null,"2011-11-10","2008-10-17"]
[null,null,null,null,"1900-09-01",null,null,null,null,null,null,null,null,null,null,null,null,null,null,"2009-08-06",{"$f":"E62","v":"2009-08-06"},{"$f":"IF(T161=C173,\" \",T161)","v":"2009-08-06"},{"$f":"IF(V161=C172,\" \",V161)","v":"2009-08-06"},{"$f":"IF(W161=C171,\" \",W161)","v":"2009-08-06"},{"$f":"IF(X161=C170,\" \",X161)","v":"2009-08-06"},{"$f":"IF(Y161=C169,\" \",Y161)","v":"2009-08-06"},{"$f":"IF(Z161=C168,\" \",Z161)","v":"2009-08-06"},{"$f":"IF(AA161=C167,\" \",AA161)","v":"2009-08-06"},{"$f":"IF(AB161=C166,\" \",AB161)","v":"2009-08-06"},{"$f":"IF(AC161=C165,\" \",AC161)","v":"2009-08-06"},{"$f":"IF(AD161=C164,\" \",AD161)","v":"2009-08-06"},{"$f":"IF(C163=AE161,\" \",AE161)","v":"2009-08-06"},{"$f":"IF(C162=AF161,\" \",AF161)","v":"2009-08-06"},{"$f":"IF(C161=AG161,\" \",AG161)","v":"2009-08-06"},{"$f":"IF(AH161=C160,\" \",AH161)","v":"2009-08-06"},{"$f":"IF(AI161=C159,\" \",AI161)","v":"2009-08-06"},{"$f":"IF(AJ161=C158,\" \",AJ161)","v":"2009-08-06"},{"$f":"IF(AK161=C157,\" \",AK161)","v":"2009-08-06"},"2011-07-31T00:14:24",6,"JUNE",1977,null,null,null,null,null,null,null,null,null,null,null,null,null,null,null,null,null,null,null,"2011-11-11","2008-10-18"]
[null,null,null,null,null,null,null,null,null,null,null,null,null,null,null,null,null,null,null,"2011-07-01","2011-07-01",{"$f":"IF(T162=C173,\" \",T162)","v":"2011-07-01"},{"$f":"IF(V162=C172,\" \",V162)","v":"2011-07-01"},{"$f":"IF(W162=C171,\" \",W162)","v":"2011-07-01"},{"$f":"IF(X162=C170,\" \",X162)","v":"2011-07-01"},{"$f":"IF(Y162=C169,\" \",Y162)","v":"2011-07-01"},{"$f":"IF(Z162=C168,\" \",Z162)","v":"2011-07-01"},{"$f":"IF(AA162=C167,\" \",AA162)","v":"2011-07-01"},{"$f":"IF(AB162=C166,\" \",AB162)","v":"2011-07-01"},{"$f":"IF(AC162=C165,\" \",AC162)","v":"2011-07-01"},{"$f":"IF(AD162=C164,\" \",AD162)","v":"2011-07-01"},{"$f":"IF(C163=AE162,\" \",AE162)","v":"2011-07-01"},{"$f":"IF(C162=AF162,\" \",AF162)","v":"2011-07-01"},{"$f":"IF(C161=AG162,\" \",AG162)","v":"2011-07-01"},{"$f":"IF(AH162=C160,\" \",AH162)","v":"2011-07-01"},{"$f":"IF(AI162=C159,\" \",AI162)","v":"2011-07-01"},{"$f":"IF(AJ162=C158,\" \",AJ162)","v":"2011-07-01"},{"$f":"IF(AK162=C157,\" \",AK162)","v":"2011-07-01"},"2011-07-31T00:14:24",7,"JULY",1978,null,null,null,null,null,null,null,null,null,null,null,null,null,null,null,null,null,null,null,"2011-11-12","2008-10-19"]
[null,null,null,null,null,null,null,null,null,null,null,null,null,null,null,null,null,null,null,"2011-07-31T00:14:24","2012-01-01",{"$f":"IF(T163=C173,\" \",T163)","v":"2011-07-31T00:14:24"},{"$f":"IF(V163=C172,\" \",V163)","v":"2011-07-31T00:14:24"},{"$f":"IF(W163=C171,\" \",W163)","v":"2011-07-31T00:14:24"},{"$f":"IF(X163=C170,\" \",X163)","v":"2011-07-31T00:14:24"},{"$f":"IF(Y163=C169,\" \",Y163)","v":"2011-07-31T00:14:24"},{"$f":"IF(Z163=C168,\" \",Z163)","v":"2011-07-31T00:14:24"},{"$f":"IF(AA163=C167,\" \",AA163)","v":"2011-07-31T00:14:24"},{"$f":"IF(AB163=C166,\" \",AB163)","v":"2011-07-31T00:14:24"},{"$f":"IF(AC163=C165,\" \",AC163)","v":"2011-07-31T00:14:24"},{"$f":"IF(AD163=C164,\" \",AD163)","v":"2011-07-31T00:14:24"},{"$f":"IF(C163=AE163,\" \",AE163)","v":"2011-07-31T00:14:24"},{"$f":"IF(C162=AF163,\" \",AF163)","v":"2011-07-31T00:14:24"},{"$f":"IF(C161=AG163,\" \",AG163)","v":"2011-07-31T00:14:24"},{"$f":"IF(AH163=C160,\" \",AH163)","v":"2011-07-31T00:14:24"},{"$f":"IF(AI163=C159,\" \",AI163)","v":"2011-07-31T00:14:24"},{"$f":"IF(AJ163=C158,\" \",AJ163)","v":"2011-07-31T00:14:24"},{"$f":"IF(AK163=C157,\" \",AK163)","v":"2011-07-31T00:14:24"},"2011-07-31T00:14:24",8,"AUGUST",1979,null,null,null,null,null,null,null,null,null,null,null,null,null,null,"1900-06-18","1900-06-19","1900-06-20","1900-06-21",null,"2011-11-13","2008-10-20","1900-06-25","1900-06-26","1900-06-27","1900-06-28","1900-06-29","2000-06-22","2000-06-23","2000-06-24","2000-06-25","2000-06-26","2000-06-27","2000-06-28","2000-06-29","2000-06-30","2000-07-01","2000-07-02","2000-07-03","2000-07-04","2000-07-05","2000-07-06","2000-07-07","2000-07-08","2000-07-09","2000-07-10","2000-07-11","2000-07-12","2000-07-13","2000-07-14","2000-07-15","2000-07-16","2000-07-17","2000-07-18","1900-06-18","1900-06-19","1900-06-20","1900-06-21","1900-06-22","1900-06-23","1900-06-24","1900-06-25","1900-06-26","1900-06-27","1900-06-28","1900-06-29","1900-06-30","1900-07-01","1900-07-02","1900-07-03","1900-07-04","1900-07-05","1900-07-06","1900-07-07","1900-07-08","1900-07-09","1900-07-10","1900-07-11","1900-07-12","1900-07-13","1900-07-14","1900-07-15","1900-07-16","1900-07-17","1900-07-18"]
[null,null,null,null,null,null,null,null,null,null,null,null,null,null,null,null,null,null,null,"2011-07-31T00:14:24","2012-07-01",{"$f":"IF(T164=C173,\" \",T164)","v":"2011-07-31T00:14:24"},{"$f":"IF(V164=C172,\" \",V164)","v":"2011-07-31T00:14:24"},{"$f":"IF(W164=C171,\" \",W164)","v":"2011-07-31T00:14:24"},{"$f":"IF(X164=C170,\" \",X164)","v":"2011-07-31T00:14:24"},{"$f":"IF(Y164=C169,\" \",Y164)","v":"2011-07-31T00:14:24"},{"$f":"IF(Z164=C168,\" \",Z164)","v":"2011-07-31T00:14:24"},{"$f":"IF(AA164=C167,\" \",AA164)","v":"2011-07-31T00:14:24"},{"$f":"IF(AB164=C166,\" \",AB164)","v":"2011-07-31T00:14:24"},{"$f":"IF(AC164=C165,\" \",AC164)","v":"2011-07-31T00:14:24"},{"$f":"IF(AD164=C164,\" \",AD164)","v":"2011-07-31T00:14:24"},{"$f":"IF(C163=AE164,\" \",AE164)","v":"2011-07-31T00:14:24"},{"$f":"IF(C162=AF164,\" \",AF164)","v":"2011-07-31T00:14:24"},{"$f":"IF(C161=AG164,\" \",AG164)","v":"2011-07-31T00:14:24"},{"$f":"IF(AH164=C160,\" \",AH164)","v":"2011-07-31T00:14:24"},{"$f":"IF(AI164=C159,\" \",AI164)","v":"2011-07-31T00:14:24"},{"$f":"IF(AJ164=C158,\" \",AJ164)","v":"2011-07-31T00:14:24"},{"$f":"IF(AK164=C157,\" \",AK164)","v":"2011-07-31T00:14:24"},"2011-07-31T00:14:24",9,"SEPTEMBER",1980,null,null,null,null,null,null,null,{"$f":"MAX(AY164:AZ164)","v":"2010-02-01"},{"$f":"G69","v":"2009-08-01"},{"$f":"F67","v":"2010-02-01"},{"$f":"E135","v":"2011-07-30T00:14:24"},"2010-02-01",{"$f":"IF(BB164<=AX164,AX164,BB164)","v":"2010-02-01"},{"$f":"IF(BC164>BA164,AX164,BC164)","v":"2010-02-01"},{"$f":"MIN(BD164:BD194)","v":"2010-02-01"},{"$f":"MIN(CR164:CR194)","v":"2010-03-01"},{"$f":"MIN(CS164:CS194)","v":"2010-04-01"},{"$f":"MIN(CT164:CT194)","v":"2010-05-01"},null,"2011-11-14","2008-10-21",null,null,null,null,null,{"$f":"MIN(CU164:CU194)","v":"2010-06-01"},"2010-07-01","2010-08-01","2010-09-01","2010-10-01","2010-11-01","2010-12-01","2011-01-01","2011-02-01","2011-03-01","2011-04-01","2011-05-01","2011-06-01","2011-07-01","00:00:00","00:00:00","00:00:00","00:00:00","00:00:00",{"$f":"MIN(DN164:DN194)","v":"00:00:00"},"00:00:00","00:00:00","00:00:00","00:00:00","00:00:00",{"$f":"MIN(DT164:DT194)","v":"00:00:00"},{"$f":"MIN(DU164:DU194)","v":"00:00:00"},{"$f":"IF(BD164=BE164,\" \",BD164)","v":" "},{"$f":"IF(CR164=BF164,\" \",CR164)","v":" "},{"$f":"IF(CS164=BG164,\" \",CS164)","v":" "},{"$f":"IF(CT164=BH164,\" \",CT164)","v":" "},{"$f":"IF(CU164=BQ164,\" \",CU164)","v":" "}," "," "," "," "," "," "," "," "," "," "," "," "," "," "," "," "," "," "," ",{"$f":"IF(DO164=CK164,\" \",DO164)","v":" "}," "," "," "," "," "," "]
[null,null,null,null,null,null,null,null,null,null,null,null,null,null,null,null,null,null,null,"2011-07-31T00:14:24",{"$f":"U159","v":"2011-07-31T00:14:24"},{"$f":"IF(T165=C173,\" \",T165)","v":"2011-07-31T00:14:24"},{"$f":"IF(V165=C172,\" \",V165)","v":"2011-07-31T00:14:24"},{"$f":"IF(W165=C171,\" \",W165)","v":"2011-07-31T00:14:24"},{"$f":"IF(X165=C170,\" \",X165)","v":"2011-07-31T00:14:24"},{"$f":"IF(Y165=C169,\" \",Y165)","v":"2011-07-31T00:14:24"},{"$f":"IF(Z165=C168,\" \",Z165)","v":"2011-07-31T00:14:24"},{"$f":"IF(AA165=C167,\" \",AA165)","v":"2011-07-31T00:14:24"},{"$f":"IF(AB165=C166,\" \",AB165)","v":"2011-07-31T00:14:24"},{"$f":"IF(AC165=C165,\" \",AC165)","v":"2011-07-31T00:14:24"},{"$f":"IF(AD165=C164,\" \",AD165)","v":"2011-07-31T00:14:24"},{"$f":"IF(C163=AE165,\" \",AE165)","v":"2011-07-31T00:14:24"},{"$f":"IF(C162=AF165,\" \",AF165)","v":"2011-07-31T00:14:24"},{"$f":"IF(C161=AG165,\" \",AG165)","v":"2011-07-31T00:14:24"},{"$f":"IF(AH165=C160,\" \",AH165)","v":"2011-07-31T00:14:24"},{"$f":"IF(AI165=C159,\" \",AI165)","v":"2011-07-31T00:14:24"},{"$f":"IF(AJ165=C158,\" \",AJ165)","v":"2011-07-31T00:14:24"},{"$f":"IF(AK165=C157,\" \",AK165)","v":"2011-07-31T00:14:24"},"2011-07-31T00:14:24",10,"OCTOBER",1981,null,null,null,null,null,null,null,{"$f":"MAX(AY165:AZ165)","v":"2010-02-01"},{"$f":"AY164","v":"2009-08-01"},{"$f":"AZ164","v":"2010-02-01"},{"$f":"BA164+0","v":"2011-07-30T00:14:24"},"2010-03-01",{"$f":"IF(BB165<=AX165,AX165,BB165)","v":"2010-03-01"},{"$f":"IF(BC165>BA165,AX164,BC165)","v":"2010-03-01"},{"$f":"BE164+0","v":"2010-02-01"},{"$f":"BF164+0","v":"2010-03-01"},{"$f":"BG164+0","v":"2010-04-01"},{"$f":"BH164+0","v":"2010-05-01"},null,"2011-11-15","2008-10-22",null,null,null,null,null,{"$f":"BQ164+0","v":"2010-06-01"},{"$f":"BR164+0","v":"2010-07-01"},{"$f":"BS164+0","v":"2010-08-01"},{"$f":"BT164+0","v":"2010-09-01"},"2010-10-01","2010-11-01","2010-12-01","2011-01-01","2011-02-01","2011-03-01","2011-04-01","2011-05-01","2011-06-01","2011-07-01","00:00:00","00:00:00","00:00:00","00:00:00","00:00:00",{"$f":"CJ164+0","v":"00:00:00"},"00:00:00","00:00:00","00:00:00","00:00:00","00:00:00","00:00:00","00:00:00",{"$f":"IF(BD165=BE165,\" \",BD165)","v":"2010-03-01"},{"$f":"IF(CR165=BF165,\" \",CR165)","v":" "},{"$f":"IF(CS165=BG165,\" \",CS165)","v":" "},{"$f":"IF(CT165=BH165,\" \",CT165)","v":" "},{"$f":"IF(CU165=BQ165,\" \",CU165)","v":" "},{"$f":"IF(CV165=BR165,\" \",CV165)","v":" "},{"$f":"IF(CW165=BS165,\" \",CW165)","v":" "},{"$f":"IF(CX165=BT165,\" \",CX165)","v":" "},{"$f":"IF(CY165=BU165,\" \",CY165)","v":" "},{"$f":"IF(CZ165=BV165,\" \",CZ165)","v":" "},{"$f":"IF(DA165=BW165,\" \",DA165)","v":" "},{"$f":"IF(DB165=BX165,\" \",DB165)","v":" "},{"$f":"IF(DC165=BY165,\" \",DC165)","v":" "},{"$f":"IF(DD165=BZ165,\" \",DD165)","v":" "},{"$f":"IF(DE165=CA165,\" \",DE165)","v":" "},{"$f":"IF(DF165=CB165,\" \",DF165)","v":" "},{"$f":"IF(DG165=CC165,\" \",DG165)","v":" "},{"$f":"IF(DH165=CD165,\" \",DH165)","v":" "},{"$f":"IF(DI165=CE165,\" \",DI165)","v":" "},{"$f":"IF(DJ165=CF165,\" \",DJ165)","v":" "},{"$f":"IF(DK165=CG165,\" \",DK165)","v":" "},{"$f":"IF(DL165=CH165,\" \",DL165)","v":" "},{"$f":"IF(DM165=CI165,\" \",DM165)","v":" "},{"$f":"IF(DN165=CJ165,\" \",DN165)","v":" "},{"$f":"IF(DO165=CK165,\" \",DO165)","v":" "},{"$f":"IF(DP165=CL165,\" \",DP165)","v":" "},{"$f":"IF(DQ165=CM165,\" \",DQ165)","v":" "},{"$f":"IF(DR165=CN165,\" \",DR165)","v":" "},{"$f":"IF(DS165=CO165,\" \",DS165)","v":" "},{"$f":"IF(DT165=CR165,\" \",DT165)","v":" "},{"$f":"IF(DU165=CS165,\" \",DU165)","v":" "}]
[null,null,null,null,null,null,null,null,null,null,null,null,null,null,null,null,null,null,null,"2011-07-31T00:14:24",{"$f":"U165","v":"2011-07-31T00:14:24"},{"$f":"IF(T166=C173,\" \",T166)","v":"2011-07-31T00:14:24"},{"$f":"IF(V166=C172,\" \",V166)","v":"2011-07-31T00:14:24"},{"$f":"IF(W166=C171,\" \",W166)","v":"2011-07-31T00:14:24"},{"$f":"IF(X166=C170,\" \",X166)","v":"2011-07-31T00:14:24"},{"$f":"IF(Y166=C169,\" \",Y166)","v":"2011-07-31T00:14:24"},{"$f":"IF(Z166=C168,\" \",Z166)","v":"2011-07-31T00:14:24"},{"$f":"IF(AA166=C167,\" \",AA166)","v":"2011-07-31T00:14:24"},{"$f":"IF(AB166=C166,\" \",AB166)","v":"2011-07-31T00:14:24"},{"$f":"IF(AC166=C165,\" \",AC166)","v":"2011-07-31T00:14:24"},{"$f":"IF(AD166=C164,\" \",AD166)","v":"2011-07-31T00:14:24"},{"$f":"IF(C163=AE166,\" \",AE166)","v":"2011-07-31T00:14:24"},{"$f":"IF(C162=AF166,\" \",AF166)","v":"2011-07-31T00:14:24"},{"$f":"IF(C161=AG166,\" \",AG166)","v":"2011-07-31T00:14:24"},{"$f":"IF(AH166=C160,\" \",AH166)","v":"2011-07-31T00:14:24"},{"$f":"IF(AI166=C159,\" \",AI166)","v":"2011-07-31T00:14:24"},{"$f":"IF(AJ166=C158,\" \",AJ166)","v":"2011-07-31T00:14:24"},{"$f":"IF(AK166=C157,\" \",AK166)","v":"2011-07-31T00:14:24"},"2011-07-31T00:14:24",11,"NOVEMBER",1982,null,null,null,null,null,null,null,"2010-02-01",{"$f":"AY165","v":"2009-08-01"},{"$f":"AZ165","v":"2010-02-01"},{"$f":"BA165+0","v":"2011-07-30T00:14:24"},"2010-04-01","2010-04-01",{"$f":"IF(BC166>BA166,AX164,BC166)","v":"2010-04-01"},{"$f":"BE165+0","v":"2010-02-01"},{"$f":"BF165+0","v":"2010-03-01"},{"$f":"BG165+0","v":"2010-04-01"},{"$f":"BH165+0","v":"2010-05-01"},null,"2011-11-16","2008-10-23",null,null,null,null,null,{"$f":"BQ165+0","v":"2010-06-01"},{"$f":"BR165+0","v":"2010-07-01"},{"$f":"BS165+0","v":"2010-08-01"},{"$f":"BT165+0","v":"2010-09-01"},{"$f":"BU165+0","v":"2010-10-01"},{"$f":"BV165+0","v":"2010-11-01"},{"$f":"BW165+0","v":"2010-12-01"},{"$f":"BX165+0","v":"2011-01-01"},{"$f":"BY165+0","v":"2011-02-01"},{"$f":"BZ165+0","v":"2011-03-01"},{"$f":"CA165+0","v":"2011-04-01"},{"$f":"CB165+0","v":"2011-05-01"},{"$f":"CC165+0","v":"2011-06-01"},{"$f":"CD165+0","v":"2011-07-01"},{"$f":"CE165+0","v":"00:00:00"},{"$f":"CF165+0","v":"00:00:00"},{"$f":"CG165+0","v":"00:00:00"},{"$f":"CH165+0","v":"00:00:00"},{"$f":"CI165+0","v":"00:00:00"},{"$f":"CJ165+0","v":"00:00:00"},{"$f":"CK165+0","v":"00:00:00"},{"$f":"CL165+0","v":"00:00:00"},{"$f":"CM165+0","v":"00:00:00"},{"$f":"CN165+0","v":"00:00:00"},{"$f":"CO165+0","v":"00:00:00"},{"$f":"CP165+0","v":"00:00:00"},{"$f":"CQ165+0","v":"00:00:00"},"2010-04-01","2010-04-01"," "," "," "," "," "," "," "," "," "," "," "," "," "," "," "," "," "," "," "," "," "," "," "," "," "," "," "," "," "]
[null,null,null,null,null,null,null,null,null,null,null,null,null,null,null,null,null,null,null,"2011-07-31T00:14:24",{"$f":"U166","v":"2011-07-31T00:14:24"},{"$f":"IF(T167=C173,\" \",T167)","v":"2011-07-31T00:14:24"},{"$f":"IF(V167=C172,\" \",V167)","v":"2011-07-31T00:14:24"},{"$f":"IF(W167=C171,\" \",W167)","v":"2011-07-31T00:14:24"},{"$f":"IF(X167=C170,\" \",X167)","v":"2011-07-31T00:14:24"},{"$f":"IF(Y167=C169,\" \",Y167)","v":"2011-07-31T00:14:24"},{"$f":"IF(Z167=C168,\" \",Z167)","v":"2011-07-31T00:14:24"},{"$f":"IF(AA167=C167,\" \",AA167)","v":"2011-07-31T00:14:24"},{"$f":"IF(AB167=C166,\" \",AB167)","v":"2011-07-31T00:14:24"},{"$f":"IF(AC167=C165,\" \",AC167)","v":"2011-07-31T00:14:24"},{"$f":"IF(AD167=C164,\" \",AD167)","v":"2011-07-31T00:14:24"},{"$f":"IF(C163=AE167,\" \",AE167)","v":"2011-07-31T00:14:24"},{"$f":"IF(C162=AF167,\" \",AF167)","v":"2011-07-31T00:14:24"},{"$f":"IF(C161=AG167,\" \",AG167)","v":"2011-07-31T00:14:24"},{"$f":"IF(AH167=C160,\" \",AH167)","v":"2011-07-31T00:14:24"},{"$f":"IF(AI167=C159,\" \",AI167)","v":"2011-07-31T00:14:24"},{"$f":"IF(AJ167=C158,\" \",AJ167)","v":"2011-07-31T00:14:24"},{"$f":"IF(AK167=C157,\" \",AK167)","v":"2011-07-31T00:14:24"},"2011-07-31T00:14:24",12,"DECEMBER",1983,null,null,null,null,null,null,null,"2010-02-01","2009-08-01","2010-02-01","2011-07-30T00:14:24","2010-05-01","2010-05-01",{"$f":"IF(BC167>BA167,AX164,BC167)","v":"2010-05-01"},"2010-02-01","2010-03-01","2010-04-01","2010-05-01",null,"2011-11-17","2008-10-24",null,null,null,null,null,"2010-06-01","2010-07-01","2010-08-01","2010-09-01","2010-10-01","2010-11-01","2010-12-01","2011-01-01","2011-02-01","2011-03-01","2011-04-01","2011-05-01","2011-06-01","2011-07-01","00:00:00","00:00:00","00:00:00","00:00:00","00:00:00","00:00:00","00:00:00","00:00:00","00:00:00","00:00:00","00:00:00","00:00:00","00:00:00","2010-05-01","2010-05-01","2010-05-01"," "," "," "," "," "," "," "," "," "," "," "," "," "," "," "," "," "," "," "," "," "," "," "," "," "," "," "," "]
[null,null,null,null,null,null,null,null,null,null,null,null,null,null,null,null,null,null,null,"2011-07-31T00:14:24","2011-07-31T00:14:24",{"$f":"IF(T168=C173,\" \",T168)","v":"2011-07-31T00:14:24"},{"$f":"IF(V168=C172,\" \",V168)","v":"2011-07-31T00:14:24"},{"$f":"IF(W168=C171,\" \",W168)","v":"2011-07-31T00:14:24"},{"$f":"IF(X168=C170,\" \",X168)","v":"2011-07-31T00:14:24"},{"$f":"IF(Y168=C169,\" \",Y168)","v":"2011-07-31T00:14:24"},{"$f":"IF(Z168=C168,\" \",Z168)","v":"2011-07-31T00:14:24"},{"$f":"IF(AA168=C167,\" \",AA168)","v":"2011-07-31T00:14:24"},{"$f":"IF(AB168=C166,\" \",AB168)","v":"2011-07-31T00:14:24"},{"$f":"IF(AC168=C165,\" \",AC168)","v":"2011-07-31T00:14:24"},{"$f":"IF(AD168=C164,\" \",AD168)","v":"2011-07-31T00:14:24"},{"$f":"IF(C163=AE168,\" \",AE168)","v":"2011-07-31T00:14:24"},{"$f":"IF(C162=AF168,\" \",AF168)","v":"2011-07-31T00:14:24"},{"$f":"IF(C161=AG168,\" \",AG168)","v":"2011-07-31T00:14:24"},{"$f":"IF(AH168=C160,\" \",AH168)","v":"2011-07-31T00:14:24"},{"$f":"IF(AI168=C159,\" \",AI168)","v":"2011-07-31T00:14:24"},{"$f":"IF(AJ168=C158,\" \",AJ168)","v":"2011-07-31T00:14:24"},{"$f":"IF(AK168=C157,\" \",AK168)","v":"2011-07-31T00:14:24"},"2011-07-31T00:14:24",13,null,1984,null,null,null,null,null,null,null,"2010-02-01","2009-08-01","2010-02-01","2011-07-30T00:14:24","2010-06-01","2010-06-01",{"$f":"IF(BC168>BA168,AX164,BC168)","v":"2010-06-01"},"2010-02-01","2010-03-01","2010-04-01","2010-05-01",null,"2011-11-18","2008-10-25",null,null,null,null,null,"2010-06-01","2010-07-01","2010-08-01","2010-09-01","2010-10-01","2010-11-01","2010-12-01","2011-01-01","2011-02-01","2011-03-01","2011-04-01","2011-05-01","2011-06-01","2011-07-01","00:00:00","00:00:00","00:00:00","00:00:00","00:00:00","00:00:00","00:00:00","00:00:00","00:00:00","00:00:00","00:00:00","00:00:00","00:00:00","2010-06-01","2010-06-01","2010-06-01","2010-06-01"," "," "," "," "," "," "," "," "," "," "," "," "," "," "," "," "," "," "," "," "," "," "," "," "," "," "," "]
[null,null,null,null,null,null,null,null,null,null,null,null,null,null,null,null,null,null,null,"2011-07-31T00:14:24","2011-07-31T00:14:24",{"$f":"IF(T169=C173,\" \",T169)","v":"2011-07-31T00:14:24"},{"$f":"IF(V169=C172,\" \",V169)","v":"2011-07-31T00:14:24"},{"$f":"IF(W169=C171,\" \",W169)","v":"2011-07-31T00:14:24"},{"$f":"IF(X169=C170,\" \",X169)","v":"2011-07-31T00:14:24"},{"$f":"IF(Y169=C169,\" \",Y169)","v":"2011-07-31T00:14:24"},{"$f":"IF(Z169=C168,\" \",Z169)","v":"2011-07-31T00:14:24"},{"$f":"IF(AA169=C167,\" \",AA169)","v":"2011-07-31T00:14:24"},{"$f":"IF(AB169=C166,\" \",AB169)","v":"2011-07-31T00:14:24"},{"$f":"IF(AC169=C165,\" \",AC169)","v":"2011-07-31T00:14:24"},{"$f":"IF(AD169=C164,\" \",AD169)","v":"2011-07-31T00:14:24"},{"$f":"IF(C163=AE169,\" \",AE169)","v":"2011-07-31T00:14:24"},{"$f":"IF(C162=AF169,\" \",AF169)","v":"2011-07-31T00:14:24"},{"$f":"IF(C161=AG169,\" \",AG169)","v":"2011-07-31T00:14:24"},{"$f":"IF(AH169=C160,\" \",AH169)","v":"2011-07-31T00:14:24"},{"$f":"IF(AI169=C159,\" \",AI169)","v":"2011-07-31T00:14:24"},{"$f":"IF(AJ169=C158,\" \",AJ169)","v":"2011-07-31T00:14:24"},{"$f":"IF(AK169=C157,\" \",AK169)","v":"2011-07-31T00:14:24"},"2011-07-31T00:14:24",14,null,1985,null,null,null,null,null,null,null,"2010-02-01","2009-08-01","2010-02-01","2011-07-30T00:14:24","2010-07-01","2010-07-01",{"$f":"IF(BC169>BA169,AX164,BC169)","v":"2010-07-01"},"2010-02-01","2010-03-01","2010-04-01","2010-05-01",null,"2011-11-19","2008-10-26",null,null,null,null,null,"2010-06-01","2010-07-01","2010-08-01","2010-09-01","2010-10-01","2010-11-01","2010-12-01","2011-01-01","2011-02-01","2011-03-01","2011-04-01","2011-05-01","2011-06-01","2011-07-01","00:00:00","00:00:00","00:00:00","00:00:00","00:00:00","00:00:00","00:00:00","00:00:00","00:00:00","00:00:00","00:00:00","00:00:00","00:00:00","2010-07-01","2010-07-01","2010-07-01","2010-07-01","2010-07-01"," "," "," "," "," "," "," "," "," "," "," "," "," "," "," "," "," "," "," "," "," "," "," "," "," "," "]
[null,null,null,null,null,null,null,null,null,null,null,null,null,null,null,null,null,null,null,"2011-07-31T00:14:24","2011-07-31T00:14:24",{"$f":"IF(T170=C173,\" \",T170)","v":"2011-07-31T00:14:24"},{"$f":"IF(V170=C172,\" \",V170)","v":"2011-07-31T00:14:24"},{"$f":"IF(W170=C171,\" \",W170)","v":"2011-07-31T00:14:24"},{"$f":"IF(X170=C170,\" \",X170)","v":"2011-07-31T00:14:24"},{"$f":"IF(Y170=C169,\" \",Y170)","v":"2011-07-31T00:14:24"},{"$f":"IF(Z170=C168,\" \",Z170)","v":"2011-07-31T00:14:24"},{"$f":"IF(AA170=C167,\" \",AA170)","v":"2011-07-31T00:14:24"},{"$f":"IF(AB170=C166,\" \",AB170)","v":"2011-07-31T00:14:24"},{"$f":"IF(AC170=C165,\" \",AC170)","v":"2011-07-31T00:14:24"},{"$f":"IF(AD170=C164,\" \",AD170)","v":"2011-07-31T00:14:24"},{"$f":"IF(C163=AE170,\" \",AE170)","v":"2011-07-31T00:14:24"},{"$f":"IF(C162=AF170,\" \",AF170)","v":"2011-07-31T00:14:24"},{"$f":"IF(C161=AG170,\" \",AG170)","v":"2011-07-31T00:14:24"},{"$f":"IF(AH170=C160,\" \",AH170)","v":"2011-07-31T00:14:24"},{"$f":"IF(AI170=C159,\" \",AI170)","v":"2011-07-31T00:14:24"},{"$f":"IF(AJ170=C158,\" \",AJ170)","v":"2011-07-31T00:14:24"},{"$f":"IF(AK170=C157,\" \",AK170)","v":"2011-07-31T00:14:24"},"2011-07-31T00:14:24",15,null,1986,null,null,null,null,null,null,null,"2010-02-01","2009-08-01","2010-02-01","2011-07-30T00:14:24","2010-08-01","2010-08-01",{"$f":"IF(BC170>BA170,AX164,BC170)","v":"2010-08-01"},"2010-02-01","2010-03-01","2010-04-01","2010-05-01",null,"2011-11-20","2008-10-27",null,null,null,null,null,"2010-06-01","2010-07-01","2010-08-01","2010-09-01","2010-10-01","2010-11-01","2010-12-01","2011-01-01","2011-02-01","2011-03-01","2011-04-01","2011-05-01","2011-06-01","2011-07-01","00:00:00","00:00:00","00:00:00","00:00:00","00:00:00","00:00:00","00:00:00","00:00:00","00:00:00","00:00:00","00:00:00","00:00:00","00:00:00","2010-08-01","2010-08-01","2010-08-01","2010-08-01","2010-08-01","2010-08-01"," "," "," "," "," "," "," "," "," "," "," "," "," "," "," "," "," "," "," "," "," "," "," "," "," "]
[null,null,null,null,null,null,null,null,null,null,null,null,null,null,null,null,null,null,null,"2011-07-31T00:14:24","2011-07-31T00:14:24",{"$f":"IF(T171=C173,\" \",T171)","v":"2011-07-31T00:14:24"},{"$f":"IF(V171=C172,\" \",V171)","v":"2011-07-31T00:14:24"},{"$f":"IF(W171=C171,\" \",W171)","v":"2011-07-31T00:14:24"},{"$f":"IF(X171=C170,\" \",X171)","v":"2011-07-31T00:14:24"},{"$f":"IF(Y171=C169,\" \",Y171)","v":"2011-07-31T00:14:24"},{"$f":"IF(Z171=C168,\" \",Z171)","v":"2011-07-31T00:14:24"},{"$f":"IF(AA171=C167,\" \",AA171)","v":"2011-07-31T00:14:24"},{"$f":"IF(AB171=C166,\" \",AB171)","v":"2011-07-31T00:14:24"},{"$f":"IF(AC171=C165,\" \",AC171)","v":"2011-07-31T00:14:24"},{"$f":"IF(AD171=C164,\" \",AD171)","v":"2011-07-31T00:14:24"},{"$f":"IF(C163=AE171,\" \",AE171)","v":"2011-07-31T00:14:24"},{"$f":"IF(C162=AF171,\" \",AF171)","v":"2011-07-31T00:14:24"},{"$f":"IF(C161=AG171,\" \",AG171)","v":"2011-07-31T00:14:24"},{"$f":"IF(AH171=C160,\" \",AH171)","v":"2011-07-31T00:14:24"},{"$f":"IF(AI171=C159,\" \",AI171)","v":"2011-07-31T00:14:24"},{"$f":"IF(AJ171=C158,\" \",AJ171)","v":"2011-07-31T00:14:24"},{"$f":"IF(AK171=C157,\" \",AK171)","v":"2011-07-31T00:14:24"},"2011-07-31T00:14:24",16,null,1987,null,null,null,null,null,null,null,"2010-02-01","2009-08-01","2010-02-01","2011-07-30T00:14:24","2010-09-01","2010-09-01",{"$f":"IF(BC171>BA171,AX164,BC171)","v":"2010-09-01"},"2010-02-01","2010-03-01","2010-04-01","2010-05-01",null,"2011-11-21","2008-10-28",null,null,null,null,null,"2010-06-01","2010-07-01","2010-08-01","2010-09-01","2010-10-01","2010-11-01","2010-12-01","2011-01-01","2011-02-01","2011-03-01","2011-04-01","2011-05-01","2011-06-01","2011-07-01","00:00:00","00:00:00","00:00:00","00:00:00","00:00:00","00:00:00","00:00:00","00:00:00","00:00:00","00:00:00","00:00:00","00:00:00","00:00:00","2010-09-01","2010-09-01","2010-09-01","2010-09-01","2010-09-01","2010-09-01","2010-09-01"," "," "," "," "," "," "," "," "," "," "," "," "," "," "," "," "," "," "," "," "," "," "," "," "]
[null,null,null,null,null,null,null,null,null,null,null,null,null,null,null,null,null,null,null,"2011-07-31T00:14:24","2011-07-31T00:14:24",{"$f":"IF(T172=C173,\" \",T172)","v":"2011-07-31T00:14:24"},{"$f":"IF(V172=C172,\" \",V172)","v":"2011-07-31T00:14:24"},{"$f":"IF(W172=C171,\" \",W172)","v":"2011-07-31T00:14:24"},{"$f":"IF(X172=C170,\" \",X172)","v":"2011-07-31T00:14:24"},{"$f":"IF(Y172=C169,\" \",Y172)","v":"2011-07-31T00:14:24"},{"$f":"IF(Z172=C168,\" \",Z172)","v":"2011-07-31T00:14:24"},{"$f":"IF(AA172=C167,\" \",AA172)","v":"2011-07-31T00:14:24"},{"$f":"IF(AB172=C166,\" \",AB172)","v":"2011-07-31T00:14:24"},{"$f":"IF(AC172=C165,\" \",AC172)","v":"2011-07-31T00:14:24"},{"$f":"IF(AD172=C164,\" \",AD172)","v":"2011-07-31T00:14:24"},{"$f":"IF(C163=AE172,\" \",AE172)","v":"2011-07-31T00:14:24"},{"$f":"IF(C1742=AF172,\" \",AF172)","v":"2011-07-31T00:14:24"},{"$f":"IF(C161=AG172,\" \",AG172)","v":"2011-07-31T00:14:24"},{"$f":"IF(AH172=C160,\" \",AH172)","v":"2011-07-31T00:14:24"},{"$f":"IF(AI172=C159,\" \",AI172)","v":"2011-07-31T00:14:24"},{"$f":"IF(AJ172=C158,\" \",AJ172)","v":"2011-07-31T00:14:24"},{"$f":"IF(AK172=C157,\" \",AK172)","v":"2011-07-31T00:14:24"},"2011-07-31T00:14:24",17,null,1988,null,null,null,null,null,null,null,"2010-02-01","2009-08-01","2010-02-01","2011-07-30T00:14:24","2010-10-01","2010-10-01",{"$f":"IF(BC172>BA172,AX164,BC172)","v":"2010-10-01"},"2010-02-01","2010-03-01","2010-04-01","2010-05-01",null,"2011-11-22","2008-10-29",null,null,null,null,null,"2010-06-01","2010-07-01","2010-08-01","2010-09-01","2010-10-01","2010-11-01","2010-12-01","2011-01-01","2011-02-01","2011-03-01","2011-04-01","2011-05-01","2011-06-01","2011-07-01","00:00:00","00:00:00","00:00:00","00:00:00","00:00:00","00:00:00","00:00:00","00:00:00","00:00:00","00:00:00","00:00:00","00:00:00","00:00:00","2010-10-01","2010-10-01","2010-10-01","2010-10-01","2010-10-01","2010-10-01","2010-10-01","2010-10-01"," "," "," "," "," "," "," "," "," "," "," "," "," "," "," "," "," "," "," "," "," "," "," "]
[null,null,null,null,null,null,null,null,null,null,null,null,null,null,null,null,null,null,null,{"$f":"E68","v":"2010-02-01"},"2011-07-31T00:14:24",{"$f":"IF(T173=C173,\" \",T173)","v":"2010-02-01"},{"$f":"IF(V173=C172,\" \",V173)","v":"2010-02-01"},{"$f":"IF(W173=C171,\" \",W173)","v":"2010-02-01"},{"$f":"IF(X173=C170,\" \",X173)","v":"2010-02-01"},{"$f":"IF(Y173=C169,\" \",Y173)","v":"2010-02-01"},{"$f":"IF(Z173=C168,\" \",Z173)","v":"2010-02-01"},{"$f":"IF(AA173=C167,\" \",AA173)","v":"2010-02-01"},{"$f":"IF(AB173=C166,\" \",AB173)","v":"2010-02-01"},{"$f":"IF(AC173=C165,\" \",AC173)","v":"2010-02-01"},{"$f":"IF(AD173=C164,\" \",AD173)","v":"2010-02-01"},{"$f":"IF(C163=AE173,\" \",AE173)","v":"2010-02-01"},{"$f":"IF(C162=AF173,\" \",AF173)","v":"2010-02-01"},{"$f":"IF(C161=AG173,\" \",AG173)","v":"2010-02-01"},{"$f":"IF(AH173=C160,\" \",AH173)","v":"2010-02-01"},{"$f":"IF(AI173=C159,\" \",AI173)","v":"2010-02-01"},{"$f":"IF(AJ173=C158,\" \",AJ173)","v":"2010-02-01"},{"$f":"IF(AK173=C157,\" \",AK173)","v":"2010-02-01"},"2011-07-31T00:14:24",18,null,1989,null,null,null,null,null,null,null,"2010-02-01","2009-08-01","2010-02-01","2011-07-30T00:14:24","2010-11-01","2010-11-01",{"$f":"IF(BC173>BA173,AX164,BC173)","v":"2010-11-01"},"2010-02-01","2010-03-01","2010-04-01","2010-05-01",null,"2011-11-23","2008-10-30",null,null,null,null,null,"2010-06-01","2010-07-01","2010-08-01","2010-09-01","2010-10-01","2010-11-01","2010-12-01","2011-01-01","2011-02-01","2011-03-01","2011-04-01","2011-05-01","2011-06-01","2011-07-01","00:00:00","00:00:00","00:00:00","00:00:00","00:00:00","00:00:00","00:00:00","00:00:00","00:00:00","00:00:00","00:00:00","00:00:00","00:00:00","2010-11-01","2010-11-01","2010-11-01","2010-11-01","2010-11-01","2010-11-01","2010-11-01","2010-11-01","2010-11-01"," "," "," "," "," "," "," "," "," "," "," "," "," "," "," "," "," "," "," "," "," "," "]
[null,null,null,null,null,null,null,null,null,null,null,null,null,null,null,null,null,null,null,"2010-04-01T00:01:26.400",{"$f":"E67","v":"2010-04-01T00:01:26.400"},{"$f":"IF(T174=C173,\" \",T174)","v":"2010-04-01T00:01:26.400"},{"$f":"IF(V174=C172,\" \",V174)","v":"2010-04-01T00:01:26.400"},{"$f":"IF(W174=C171,\" \",W174)","v":"2010-04-01T00:01:26.400"},{"$f":"IF(X174=C170,\" \",X174)","v":"2010-04-01T00:01:26.400"},{"$f":"IF(Y174=C169,\" \",Y174)","v":"2010-04-01T00:01:26.400"},{"$f":"IF(Z174=C168,\" \",Z174)","v":"2010-04-01T00:01:26.400"},{"$f":"IF(AA174=C167,\" \",AA174)","v":"2010-04-01T00:01:26.400"},{"$f":"IF(AB174=C166,\" \",AB174)","v":"2010-04-01T00:01:26.400"},{"$f":"IF(AC174=C165,\" \",AC174)","v":"2010-04-01T00:01:26.400"},{"$f":"IF(AD174=C164,\" \",AD174)","v":"2010-04-01T00:01:26.400"},{"$f":"IF(C163=AE174,\" \",AE174)","v":"2010-04-01T00:01:26.400"},{"$f":"IF(C162=AF174,\" \",AF174)","v":"2010-04-01T00:01:26.400"},{"$f":"IF(C161=AG174,\" \",AG174)","v":"2010-04-01T00:01:26.400"},{"$f":"IF(AH174=C160,\" \",AH174)","v":"2010-04-01T00:01:26.400"},{"$f":"IF(AI174=C159,\" \",AI174)","v":"2010-04-01T00:01:26.400"},{"$f":"IF(AJ174=C158,\" \",AJ174)","v":"2010-04-01T00:01:26.400"},{"$f":"IF(AK174=C157,\" \",AK174)","v":"2010-04-01T00:01:26.400"},"2011-07-31T00:14:24",19,null,1990,null,null,null,null,null,null,null,"2010-02-01","2009-08-01","2010-02-01","2011-07-30T00:14:24","2010-12-01","2010-12-01",{"$f":"IF(BC174>BA174,AX164,BC174)","v":"2010-12-01"},"2010-02-01","2010-03-01","2010-04-01","2010-05-01",null,"2011-11-24","2008-10-31",null,null,null,null,null,"2010-06-01","2010-07-01","2010-08-01","2010-09-01","2010-10-01","2010-11-01","2010-12-01","2011-01-01","2011-02-01","2011-03-01","2011-04-01","2011-05-01","2011-06-01","2011-07-01","00:00:00","00:00:00","00:00:00","00:00:00","00:00:00","00:00:00","00:00:00","00:00:00","00:00:00","00:00:00","00:00:00","00:00:00","00:00:00","2010-12-01","2010-12-01","2010-12-01","2010-12-01","2010-12-01","2010-12-01","2010-12-01","2010-12-01","2010-12-01","2010-12-01"," "," "," "," "," "," "," "," "," "," "," "," "," "," "," "," "," "," "," "," "," "]
[null,null,null,null,null,null,null,null,null,null,null,null,null,null,null,null,null,null,null,null,null,null,null,null,null,null,null,null,null,null,null,null,null,null,null,null,null,null,null,20,null,1991,null,null,null,null,null,null,null,"2010-02-01",{"$f":"AY174","v":"2009-08-01"},{"$f":"AZ174","v":"2010-02-01"},{"$f":"BA174+0","v":"2011-07-30T00:14:24"},"2011-01-01","2011-01-01",{"$f":"IF(BC175>BA175,AX164,BC175)","v":"2011-01-01"},{"$f":"BE174+0","v":"2010-02-01"},{"$f":"BF174+0","v":"2010-03-01"},{"$f":"BG174+0","v":"2010-04-01"},{"$f":"BH174+0","v":"2010-05-01"},null,"2011-11-25","2008-11-01",null,null,null,null,null,{"$f":"BQ174+0","v":"2010-06-01"},"2010-07-01","2010-08-01","2010-09-01","2010-10-01","2010-11-01","2010-12-01","2011-01-01","2011-02-01","2011-03-01","2011-04-01","2011-05-01","2011-06-01","2011-07-01","00:00:00","00:00:00","00:00:00","00:00:00","00:00:00","00:00:00","00:00:00","00:00:00","00:00:00","00:00:00","00:00:00","00:00:00","00:00:00","2011-01-01","2011-01-01","2011-01-01","2011-01-01","2011-01-01","2011-01-01","2011-01-01","2011-01-01","2011-01-01","2011-01-01","2011-01-01"," "," "," "," "," "," "," "," "," "," "," "," "," "," "," "," "," "," "," "," "]
[null,null,null,null,null,null,null,null,null,null,null,null,null,null,null,null,null,null,null,null,null,null,null,null,null,null,null,null,null,null,null,null,null,null,null,null,null,null,null,21,null,1992,null,null,null,null,null,null,null,"2010-02-01","2009-08-01","2010-02-01","2011-07-30T00:14:24","2011-02-01","2011-02-01",{"$f":"IF(BC176>BA176,AX164,BC176)","v":"2011-02-01"},"2010-02-01","2010-03-01","2010-04-01","2010-05-01",null,"2011-11-26","2008-11-02",null,null,null,null,null,"2010-06-01","2010-07-01","2010-08-01","2010-09-01","2010-10-01","2010-11-01","2010-12-01","2011-01-01","2011-02-01","2011-03-01","2011-04-01","2011-05-01","2011-06-01","2011-07-01","00:00:00","00:00:00","00:00:00","00:00:00","00:00:00","00:00:00","00:00:00","00:00:00","00:00:00","00:00:00","00:00:00","00:00:00","00:00:00","2011-02-01","2011-02-01","2011-02-01","2011-02-01","2011-02-01","2011-02-01","2011-02-01","2011-02-01","2011-02-01","2011-02-01","2011-02-01","2011-02-01"," "," "," "," "," "," "," "," "," "," "," "," "," "," "," "," "," "," "," "]
[null,null,null,null,null,null,null,null,null,null,null,null,null,null,null,null,null,null,null,null,null,null,null,null,null,null,null,null,null,null,null,null,null,null,null,null,null,null,null,22,null,1993,null,null,null,null,null,null,null,"2010-02-01","2009-08-01","2010-02-01","2011-07-30T00:14:24","2011-03-01","2011-03-01",{"$f":"IF(BC177>BA177,AX164,BC177)","v":"2011-03-01"},"2010-02-01","2010-03-01","2010-04-01","2010-05-01",null,"2011-11-27","2008-11-03",null,null,null,null,null,"2010-06-01","2010-07-01","2010-08-01","2010-09-01","2010-10-01","2010-11-01","2010-12-01","2011-01-01","2011-02-01","2011-03-01","2011-04-01","2011-05-01","2011-06-01","2011-07-01","00:00:00","00:00:00","00:00:00","00:00:00","00:00:00","00:00:00","00:00:00","00:00:00","00:00:00","00:00:00","00:00:00","00:00:00","00:00:00","2011-03-01","2011-03-01","2011-03-01","2011-03-01","2011-03-01","2011-03-01","2011-03-01","2011-03-01","2011-03-01","2011-03-01","2011-03-01","2011-03-01","2011-03-01"," "," "," "," "," "," "," "," "," "," "," "," "," "," "," "," "," "," "]
[null,null,null,null,null,null,null,null,null,null,null,null,null,null,null,null,null,null,null,null,null,null,null,null,null,null,null,null,null,null,null,null,null,null,null,null,null,null,null,23,null,1994,null,null,null,null,null,null,null,"2010-02-01","2009-08-01","2010-02-01","2011-07-30T00:14:24","2011-04-01","2011-04-01",{"$f":"IF(BC178>BA178,AX164,BC178)","v":"2011-04-01"},"2010-02-01","2010-03-01","2010-04-01","2010-05-01",null,"2011-11-28","2008-11-04",null,null,null,null,null,"2010-06-01","2010-07-01","2010-08-01","2010-09-01","2010-10-01","2010-11-01","2010-12-01","2011-01-01","2011-02-01","2011-03-01","2011-04-01","2011-05-01","2011-06-01","2011-07-01","00:00:00","00:00:00","00:00:00","00:00:00","00:00:00","00:00:00","00:00:00","00:00:00","00:00:00","00:00:00","00:00:00","00:00:00","00:00:00","2011-04-01","2011-04-01","2011-04-01","2011-04-01","2011-04-01","2011-04-01","2011-04-01","2011-04-01","2011-04-01","2011-04-01","2011-04-01","2011-04-01","2011-04-01","2011-04-01"," "," "," "," "," "," "," "," "," "," "," "," "," "," "," "," "," "]
[null,null,null,null,null,null,null,null,null,null,null,null,null,null,null,null,null,null,null,null,null,null,null,null,null,null,null,null,null,null,null,null,null,null,null,null,null,null,null,24,null,1995,null,null,null,null,null,null,null,"2010-02-01","2009-08-01","2010-02-01","2011-07-30T00:14:24","2011-05-01","2011-05-01",{"$f":"IF(BC179>BA179,AX164,BC179)","v":"2011-05-01"},"2010-02-01","2010-03-01","2010-04-01","2010-05-01",null,"2011-11-29","2008-11-05",null,null,null,null,null,"2010-06-01","2010-07-01","2010-08-01","2010-09-01","2010-10-01","2010-11-01","2010-12-01","2011-01-01","2011-02-01","2011-03-01","2011-04-01","2011-05-01","2011-06-01","2011-07-01","00:00:00","00:00:00","00:00:00","00:00:00","00:00:00","00:00:00","00:00:00","00:00:00","00:00:00","00:00:00","00:00:00","00:00:00","00:00:00","2011-05-01","2011-05-01","2011-05-01","2011-05-01","2011-05-01","2011-05-01","2011-05-01","2011-05-01","2011-05-01","2011-05-01","2011-05-01","2011-05-01","2011-05-01","2011-05-01","2011-05-01"," "," "," "," "," "," "," "," "," "," "," "," "," "," "," "," "]
[null,null,null,null,null,null,null,null,null,null,null,null,null,null,null,null,null,null,null,null,null,null,null,null,null,null,null,null,null,null,null,null,null,null,null,null,null,null,null,25,null,1996,null,null,null,null,null,null,null,"2010-02-01","2009-08-01","2010-02-01","2011-07-30T00:14:24","2011-06-01","2011-06-01",{"$f":"IF(BC180>BA180,AX164,BC180)","v":"2011-06-01"},"2010-02-01","2010-03-01","2010-04-01","2010-05-01",null,"2011-11-30","2008-11-06",null,null,null,null,null,"2010-06-01","2010-07-01","2010-08-01","2010-09-01","2010-10-01","2010-11-01","2010-12-01","2011-01-01","2011-02-01","2011-03-01","2011-04-01","2011-05-01","2011-06-01","2011-07-01","00:00:00","00:00:00","00:00:00","00:00:00","00:00:00","00:00:00","00:00:00","00:00:00","00:00:00","00:00:00","00:00:00","00:00:00","00:00:00","2011-06-01","2011-06-01","2011-06-01","2011-06-01","2011-06-01","2011-06-01","2011-06-01","2011-06-01","2011-06-01","2011-06-01","2011-06-01","2011-06-01","2011-06-01","2011-06-01","2011-06-01","2011-06-01"," "," "," "," "," "," "," "," "," "," "," "," "," "," "," "]
[null,null,null,null,null,null,null,null,null,null,null,null,null,null,null,null,null,null,null,null,null,null,null,null,null,null,null,null,null,null,null,null,null,null,null,null,null,null,null,26,null,1997,null,null,null,null,null,null,null,"2010-02-01","2009-08-01","2010-02-01","2011-07-30T00:14:24","2011-07-01","2011-07-01",{"$f":"IF(BC181>BA181,AX164,BC181)","v":"2011-07-01"},"2010-02-01","2010-03-01","2010-04-01","2010-05-01",null,"2011-12-01","2008-11-07",null,null,null,null,null,"2010-06-01","2010-07-01","2010-08-01","2010-09-01","2010-10-01","2010-11-01","2010-12-01","2011-01-01","2011-02-01","2011-03-01","2011-04-01","2011-05-01","2011-06-01","2011-07-01","00:00:00","00:00:00","00:00:00","00:00:00","00:00:00","00:00:00","00:00:00","00:00:00","00:00:00","00:00:00","00:00:00","00:00:00","00:00:00","2011-07-01","2011-07-01","2011-07-01","2011-07-01","2011-07-01","2011-07-01","2011-07-01","2011-07-01","2011-07-01","2011-07-01","2011-07-01","2011-07-01","2011-07-01","2011-07-01","2011-07-01","2011-07-01","2011-07-01"," "," "," "," "," "," "," "," "," "," "," "," "," "," "]
[null,null,null,null,null,null,null,null,null,null,null,null,null,null,null,null,null,null,null,null,null,null,null,null,null,null,null,null,null,null,null,null,null,null,null,null,null,null,null,27,null,1998,null,null,null,null,null,null,null,"2010-02-01","2009-08-01","2010-02-01","2011-07-30T00:14:24","2011-08-01","2011-08-01",{"$f":"IF(BC182>BA182,AX164,BC182)","v":"2010-02-01"},"2010-02-01","2010-03-01","2010-04-01","2010-05-01",null,"2011-12-02","2008-11-08",null,null,null,null,null,"2010-06-01","2010-07-01","2010-08-01","2010-09-01","2010-10-01","2010-11-01","2010-12-01","2011-01-01","2011-02-01","2011-03-01","2011-04-01","2011-05-01","2011-06-01","2011-07-01","00:00:00","00:00:00","00:00:00","00:00:00","00:00:00","00:00:00","00:00:00","00:00:00","00:00:00","00:00:00","00:00:00","00:00:00","00:00:00"," "," "," "," "," "," "," "," "," "," "," "," "," "," "," "," "," "," "," "," "," "," "," "," "," "," "," "," "," "," "," "]
[null,null,null,null,null,null,null,null,null,null,null,null,null,null,null,null,null,null,null,null,null,null,null,null,null,null,null,null,null,null,null,null,null,null,null,null,null,null,null,28,null,1999,null,null,null,null,null,null,null,"2010-02-01","2009-08-01","2010-02-01","2011-07-30T00:14:24","2011-09-01","2011-09-01",{"$f":"IF(BC183>BA183,AX164,BC183)","v":"2010-02-01"},"2010-02-01","2010-03-01","2010-04-01","2010-05-01",null,"2011-12-03","2008-11-09",null,null,null,null,null,"2010-06-01","2010-07-01","2010-08-01","2010-09-01","2010-10-01","2010-11-01","2010-12-01","2011-01-01","2011-02-01","2011-03-01","2011-04-01","2011-05-01","2011-06-01","2011-07-01","00:00:00","00:00:00","00:00:00","00:00:00","00:00:00","00:00:00","00:00:00","00:00:00","00:00:00","00:00:00","00:00:00","00:00:00","00:00:00"," "," "," "," "," "," "," "," "," "," "," "," "," "," "," "," "," "," "," "," "," "," "," "," "," "," "," "," "," "," "," "]
[null,null,null,null,null,null,null,null,null,null,null,null,null,null,null,null,null,null,null,null,null,null,null,null,null,null,null,null,null,null,null,null,null,null,null,null,null,null,null,29,null,2000,null,null,null,null,null,null,null,"2010-02-01","2009-08-01","2010-02-01","2011-07-30T00:14:24","2011-10-01","2011-10-01",{"$f":"IF(BC184>BA184,AX164,BC184)","v":"2010-02-01"},"2010-02-01","2010-03-01","2010-04-01","2010-05-01",null,"2011-12-04","2008-11-10",null,null,null,null,null,"2010-06-01","2010-07-01","2010-08-01","2010-09-01","2010-10-01","2010-11-01","2010-12-01","2011-01-01","2011-02-01","2011-03-01","2011-04-01","2011-05-01","2011-06-01","2011-07-01","00:00:00","00:00:00","00:00:00","00:00:00","00:00:00","00:00:00","00:00:00","00:00:00","00:00:00","00:00:00","00:00:00","00:00:00","00:00:00"," "," "," "," "," "," "," "," "," "," "," "," "," "," "," "," "," "," "," "," "," "," "," "," "," "," "," "," "," "," "," "]
[null,null,null,null,null,null,null,null,null,null,null,null,null,null,null,null,null,null,null,null,null,null,null,null,null,null,null,null,null,null,null,null,null,null,null,null,null,null,null,30,null,2001,null,null,null,null,null,null,null,"2010-02-01","2009-08-01","2010-02-01","2011-07-30T00:14:24","2011-11-01","2011-11-01",{"$f":"IF(BC185>BA185,AX164,BC185)","v":"2010-02-01"},"2010-02-01","2010-03-01","2010-04-01","2010-05-01",null,"2011-12-05","2008-11-11",null,null,null,null,null,"2010-06-01","2010-07-01","2010-08-01","2010-09-01","2010-10-01","2010-11-01","2010-12-01","2011-01-01","2011-02-01","2011-03-01","2011-04-01","2011-05-01","2011-06-01","2011-07-01","00:00:00","00:00:00","00:00:00","00:00:00","00:00:00","00:00:00","00:00:00","00:00:00","00:00:00","00:00:00","00:00:00","00:00:00","00:00:00"," "," "," "," "," "," "," "," "," "," "," "," "," "," "," "," "," "," "," "," "," "," "," "," "," "," "," "," "," "," "," "]
[null,null,null,null,null,null,null,null,null,null,null,null,null,null,null,null,null,null,null,null,null,null,null,null,null,null,null,null,null,null,null,null,null,null,null,null,null,null,null,31,null,2002,null,null,null,null,null,null,null,"2010-02-01","2009-08-01","2010-02-01","2011-07-30T00:14:24","2011-12-01","2011-12-01",{"$f":"IF(BC186>BA186,AX164,BC186)","v":"2010-02-01"},"2010-02-01","2010-03-01","2010-04-01","2010-05-01",null,"2011-12-06","2008-11-12",null,null,null,null,null,"2010-06-01","2010-07-01","2010-08-01","2010-09-01","2010-10-01","2010-11-01","2010-12-01","2011-01-01","2011-02-01","2011-03-01","2011-04-01","2011-05-01","2011-06-01","2011-07-01","00:00:00","00:00:00","00:00:00","00:00:00","00:00:00","00:00:00","00:00:00","00:00:00","00:00:00","00:00:00","00:00:00","00:00:00","00:00:00"," "," "," "," "," "," "," "," "," "," "," "," "," "," "," "," "," "," "," "," "," "," "," "," "," "," "," "," "," "," "," "]
[null,null,null,null,null,null,null,null,null,null,null,null,null,null,null,null,null,null,null,null,null,null,null,null,null,null,null,null,null,null,null,null,null,null,null,null,null,null,null,null,null,2003,null,null,null,null,null,null,null,"2010-02-01","2009-08-01","2010-02-01","2011-07-30T00:14:24","2012-01-01","2012-01-01",{"$f":"IF(BC187>BA187,AX164,BC187)","v":"2010-02-01"},"2010-02-01","2010-03-01","2010-04-01","2010-05-01",null,"2011-12-07","2008-11-13",null,null,null,null,null,"2010-06-01","2010-07-01","2010-08-01","2010-09-01","2010-10-01","2010-11-01","2010-12-01","2011-01-01","2011-02-01","2011-03-01","2011-04-01","2011-05-01","2011-06-01","2011-07-01","00:00:00","00:00:00","00:00:00","00:00:00","00:00:00","00:00:00","00:00:00","00:00:00","00:00:00","00:00:00","00:00:00","00:00:00","00:00:00"," "," "," "," "," "," "," "," "," "," "," "," "," "," "," "," "," "," "," "," "," "," "," "," "," "," "," "," "," "," "," "]
[null,null,null,null,null,null,null,null,null,null,null,null,null,null,null,null,null,null,null,null,null,null,null,null,null,null,null,null,null,null,null,null,null,null,null,null,null,null,null,null,null,2004,null,null,null,null,null,null,null,"2010-02-01","2009-08-01","2010-02-01","2011-07-30T00:14:24","2012-02-01","2012-02-01",{"$f":"IF(BC188>BA188,AX164,BC188)","v":"2010-02-01"},"2010-02-01","2010-03-01","2010-04-01","2010-05-01",null,"2011-12-08","2008-11-14",null,null,null,null,null,"2010-06-01","2010-07-01","2010-08-01","2010-09-01","2010-10-01","2010-11-01","2010-12-01","2011-01-01","2011-02-01","2011-03-01","2011-04-01","2011-05-01","2011-06-01","2011-07-01","00:00:00","00:00:00","00:00:00","00:00:00","00:00:00","00:00:00","00:00:00","00:00:00","00:00:00","00:00:00","00:00:00","00:00:00","00:00:00"," "," "," "," "," "," "," "," "," "," "," "," "," "," "," "," "," "," "," "," "," "," "," "," "," "," "," "," "," "," "," "]
[null,null,null,null,null,null,null,null,null,null,null,null,null,null,null,null,null,null,null,null,null,null,null,null,null,null,null,null,null,null,null,null,null,null,null,null,null,null,null,null,null,2005,null,null,null,null,null,null,null,"2010-02-01","2009-08-01","2010-02-01","2011-07-30T00:14:24","2012-03-01","2012-03-01",{"$f":"IF(BC189>BA189,AX164,BC189)","v":"2010-02-01"},"2010-02-01","2010-03-01","2010-04-01","2010-05-01",null,"2011-12-09","2008-11-15",null,null,null,null,null,"2010-06-01","2010-07-01","2010-08-01","2010-09-01","2010-10-01","2010-11-01","2010-12-01","2011-01-01","2011-02-01","2011-03-01","2011-04-01","2011-05-01","2011-06-01","2011-07-01","00:00:00","00:00:00","00:00:00","00:00:00","00:00:00","00:00:00","00:00:00","00:00:00","00:00:00","00:00:00","00:00:00","00:00:00","00:00:00"," "," "," "," "," "," "," "," "," "," "," "," "," "," "," "," "," "," "," "," "," "," "," "," "," "," "," "," "," "," "," "]
[null,null,null,null,null,null,null,null,null,null,null,null,null,null,null,null,null,null,null,null,null,null,null,null,null,null,null,null,null,null,null,null,null,null,null,null,null,null,null,null,null,2006,null,null,null,null,null,null,null,"2010-02-01","2009-08-01","2010-02-01","2011-07-30T00:14:24","2012-04-01","2012-04-01",{"$f":"IF(BC190>BA190,AX164,BC190)","v":"2010-02-01"},"2010-02-01","2010-03-01","2010-04-01","2010-05-01",null,"2011-12-10","2008-11-16",null,null,null,null,null,"2010-06-01","2010-07-01","2010-08-01","2010-09-01","2010-10-01","2010-11-01","2010-12-01","2011-01-01","2011-02-01","2011-03-01","2011-04-01","2011-05-01","2011-06-01","2011-07-01","00:00:00","00:00:00","00:00:00","00:00:00","00:00:00","00:00:00","00:00:00","00:00:00","00:00:00","00:00:00","00:00:00","00:00:00","00:00:00"," "," "," "," "," "," "," "," "," "," "," "," "," "," "," "," "," "," "," "," "," "," "," "," "," "," "," "," "," "," "," "]
[null,null,null,null,null,null,null,null,null,null,null,null,null,null,null,null,null,null,null,null,null,null,null,null,null,null,null,null,null,null,null,null,null,null,null,null,null,null,null,null,null,2007,null,null,null,null,null,null,null,"2010-02-01","2009-08-01","2010-02-01","2011-07-30T00:14:24",{"$f":"IF(E36=E37,E65,E136)","v":"2011-07-31T00:14:24"},"2011-07-31T00:14:24",{"$f":"IF(BC191>BA191,AX164,BC191)","v":"2010-02-01"},"2010-02-01","2010-03-01","2010-04-01","2010-05-01",null,"2011-12-11","2008-11-17",null,null,null,null,null,"2010-06-01","2010-07-01","2010-08-01","2010-09-01","2010-10-01","2010-11-01","2010-12-01","2011-01-01","2011-02-01","2011-03-01","2011-04-01","2011-05-01","2011-06-01","2011-07-01","00:00:00","00:00:00","00:00:00","00:00:00","00:00:00","00:00:00","00:00:00","00:00:00","00:00:00","00:00:00","00:00:00","00:00:00","00:00:00"," "," "," "," "," "," "," "," "," "," "," "," "," "," "," "," "," "," "," "," "," "," "," "," "," "," "," "," "," "," "," "]
[null,null,null,null,null,null,null,null,null,null,null,null,null,null,null,null,null,null,null,null,null,null,null,null,null,null,null,null,null,null,null,null,null,null,null,null,null,null,null,null,null,2008,null,null,null,null,null,null,null,"2010-02-01","2009-08-01","2010-02-01","2011-07-30T00:14:24",{"$f":"E68","v":"2010-02-01"},"2010-02-01",{"$f":"IF(BC192>BA192,AX164,BC192)","v":"2010-02-01"},"2010-02-01","2010-03-01","2010-04-01","2010-05-01",null,"2011-12-12","2008-11-18",null,null,null,null,null,"2010-06-01","2010-07-01","2010-08-01","2010-09-01","2010-10-01","2010-11-01","2010-12-01","2011-01-01","2011-02-01","2011-03-01","2011-04-01","2011-05-01","2011-06-01","2011-07-01","00:00:00","00:00:00","00:00:00","00:00:00","00:00:00","00:00:00","00:00:00","00:00:00","00:00:00","00:00:00","00:00:00","00:00:00","00:00:00"," "," "," "," "," "," "," "," "," "," "," "," "," "," "," "," "," "," "," "," "," "," "," "," "," "," "," "," "," "," "," "]
[null,null,null,null,null,null,null,null,null,null,null,null,null,null,null,null,null,null,null,null,null,null,null,null,null,null,null,null,null,null,null,null,null,null,null,null,null,null,null,null,null,2009,null,null,null,null,null,null,null,"2010-02-01","2009-08-01","2010-02-01","2011-07-30T00:14:24",{"$f":"IF(E41=O107,40210,E138)","v":"2010-02-01"},"2010-02-01",{"$f":"IF(BC193>BA193,AX164,BC193)","v":"2010-02-01"},"2010-02-01","2010-03-01","2010-04-01","2010-05-01",null,"2011-12-13","2008-11-19",null,null,null,null,null,"2010-06-01","2010-07-01","2010-08-01","2010-09-01","2010-10-01","2010-11-01","2010-12-01","2011-01-01","2011-02-01","2011-03-01","2011-04-01","2011-05-01","2011-06-01","2011-07-01","00:00:00","00:00:00","00:00:00","00:00:00","00:00:00","00:00:00","00:00:00","00:00:00","00:00:00","00:00:00","00:00:00","00:00:00","00:00:00"," "," "," "," "," "," "," "," "," "," "," "," "," "," "," "," "," "," "," "," "," "," "," "," "," "," "," "," "," "," "," "]
[null,null,null,null,null,null,null,null,null,null,null,null,null,null,null,null,null,null,null,null,null,null,null,null,null,null,null,null,null,null,null,null,null,null,null,null,null,null,null,null,null,2010,null,null,null,null,null,null,null,"2010-02-01","2009-08-01","2010-02-01","2011-07-30T00:14:24",{"$f":"F69","v":"2010-02-01"},"2010-02-01",{"$f":"IF(BC194>BA194,AX164,BC194)","v":"2010-02-01"},"2010-02-01","2010-03-01","2010-04-01","2010-05-01",null,"2011-12-14","2008-11-20",null,null,null,null,null,"2010-06-01","2010-07-01","2010-08-01","2010-09-01","2010-10-01","2010-11-01","2010-12-01","2011-01-01","2011-02-01","2011-03-01","2011-04-01","2011-05-01","2011-06-01","2011-07-01","00:00:00","00:00:00","00:00:00","00:00:00","00:00:00","00:00:00","00:00:00","00:00:00","00:00:00","00:00:00","00:00:00","00:00:00","00:00:00"," "," "," "," "," "," "," "," "," "," "," "," "," "," "," "," "," "," "," "," "," "," "," "," "," "," "," "," "," "," "," "]
[null,null,null,null,null,null,null,null,null,null,null,null,null,null,null,null,null,null,null,null,null,null,null,null,null,null,null,null,null,null,null,null,null,null,null,null,null,null,null,null,null,2011,null,null,null,null,null,null,null,null,null,null,null,null,null,null,null,null,null,null,null,"2011-12-15","2008-11-21"]
[null,null,null,null,null,null,null,null,null,null,null,null,null,null,null,null,null,null,null,null,null,null,null,null,null,null,null,null,null,null,null,null,null,null,null,null,null,null,null,null,null,2012,null,null,null,null,null,null,null,null,null,null,null,null,null,null,null,null,null,null,null,"2011-12-16","2008-11-22"]
[null,null,null,null,null,null,null,null,null,null,null,null,null,null,null,null,null,null,null,null,null,null,null,null,null,null,null,null,null,null,null,null,null,null,null,null,null,null,null,null,null,2013,null,null,null,null,null,null,null,null,null,null,null,null,null,null,null,null,null,null,null,"2011-12-17","2008-11-23"]
[null,null,null,null,null,null,null,null,null,null,null,null,null,null,null,null,null,null,null,null,null,null,null,null,null,null,null,null,null,null,null,null,null,null,null,null,null,null,null,null,null,null,null,null,null,null,null,null,null,null,null,null,null,null,null,null,null,null,null,null,null,"2011-12-18","2008-11-24"]
[null,null,null,null,null,null,null,null,null,null,null,null,null,null,null,null,null,null,null,null,null,null,null,null,null,null,null,null,null,null,null,null,null,null,null,null,null,null,null,null,null,null,null,null,null,null,null,null,null,null,null,null,null,null,null,null,null,null,null,null,null,"2011-12-19","2008-11-25"]
[null,null,null,null,null,null,null,null,null,null,null,null,null,null,null,null,null,null,null,null,null,null,null,null,null,null,null,null,null,null,null,null,null,null,null,null,null,null,null,null,null,null,null,null,null,null,null,null,null,null,null,null,null,null,null,null,null,null,null,null,null,"2011-12-20","2008-11-26"]
[null,null,null,null,null,null,null,null,null,null,null,null,null,null,null,null,null,null,null,null,null,null,null,null,null,null,null,null,null,null,null,null,null,null,null,null,null,null,null,null,null,null,null,null,null,null,null,null,null,null,null,null,null,null,null,null,null,null,null,null,null,"2011-12-21","2008-11-27"]
[null,null,null,null,null,null,null,null,null,null,null,null,null,null,null,null,null,null,null,null,null,null,null,null,null,null,null,null,null,null,null,null,null,null,null,null,null,null,null,null,null,null,null,null,null,null,null,null,null,null,null,null,null,null,null,null,null,null,null,null,null,"2011-12-22","2008-11-28"]
[null,null,null,null,null,null,null,null,null,null,null,null,null,null,null,null,null,null,null,null,null,null,null,null,null,null,null,null,null,null,null,null,null,null,null,null,null,null,null,null,null,null,null,null,null,null,null,null,null,null,null,null,null,null,null,null,null,null,null,null,null,"2011-12-23","2008-11-29"]
[null,null,null,null,null,null,null,null,null,null,null,null,null,null,null,null,null,null,null,null,null,null,null,null,null,null,null,null,null,null,null,null,null,null,null,null,null,null,null,null,null,null,null,null,null,null,null,null,null,null,null,null,null,null,null,null,null,null,null,null,null,"2011-12-24","2008-11-30"]
[null,null,null,null,null,null,null,null,null,null,null,null,null,null,null,null,null,null,null,null,null,null,null,null,null,null,null,null,null,null,null,null,null,null,null,null,null,null,null,null,null,null,null,null,null,null,null,null,null,null,null,null,null,null,null,null,null,null,null,null,null,"2011-12-25","2008-12-01"]
[null,null,null,null,null,null,null,null,null,null,null,null,null,null,null,null,null,null,null,null,null,null,null,null,null,null,null,null,null,null,null,null,null,null,null,null,null,null,null,null,null,null,null,null,null,null,null,null,null,null,null,null,null,null,null,null,null,null,null,null,null,"2011-12-26","2008-12-02"]
[null,null,null,null,null,null,null,null,null,null,null,null,null,null,null,null,null,null,null,null,null,null,null,null,null,null,null,null,null,null,null,null,null,null,null,null,null,null,null,null,null,null,null,null,null,null,null,null,null,null,null,null,null,null,null,null,null,null,null,null,null,"2011-12-27","2008-12-03"]
[null,null,null,null,null,null,null,null,null,null,null,null,null,null,null,null,null,null,null,null,null,null,null,null,null,null,null,null,null,null,null,null,null,null,null,null,null,null,null,null,null,null,null,null,null,null,null,null,null,null,null,null,null,null,null,null,null,null,null,null,null,"2011-12-28","2008-12-04"]
[null,null,null,null,null,null,null,null,null,null,null,null,null,null,null,null,null,null,null,null,null,null,null,null,null,null,null,null,null,null,null,null,null,null,null,null,null,null,null,null,null,null,null,null,null,null,null,null,null,null,null,null,null,null,null,null,null,null,null,null,null,"2011-12-29","2008-12-05"]
[null,null,null,null,null,null,null,null,null,null,null,null,null,null,null,null,null,null,null,null,null,null,null,null,null,null,null,null,null,null,null,null,null,null,null,null,null,null,null,null,null,null,null,null,null,null,null,null,null,null,null,null,null,null,null,null,null,null,null,null,null,"2011-12-30","2008-12-06"]
[null,null,null,null,null,null,null,null,null,null,null,null,null,null,null,null,null,null,null,null,null,4825,7769,10564,null,null,null,null,null,null,null,null,null,null,null,null,null,null,null,null,null,null,null,null,null,null,null,null,null,null,null,null,null,null,null,null,null,null,null,null,null,"2011-12-31","2008-12-07"]
[null,null,null,null,null,null,null,null,null,null,null,null,null,null,null,null,null,null,null,null,null,85,120,180,275,null,null,null,null,null,null,null,null,null,null,null,null,null,null,null,null,null,null,null,null,null,null,null,null,null,null,null,null,null,null,null,null,null,null,null,null,"2012-01-01","2008-12-08"]
[null,null,null,null,null,null,null,null,null,null,null,null,null,null,null,null,null,null,null,null,null,60,80,125,200,null,null,null,null,null,null,null,null,null,null,null,null,null,null,null,null,null,null,null,null,null,null,null,null,null,null,null,null,null,null,null,null,null,null,null,null,"2012-01-02","2008-12-09"]
[null,null,null,null,null,null,null,null,null,null,null,null,null,null,null,null,null,null,null,null,null,50,60,70,80,null,null,null,null,null,null,null,null,null,null,null,null,null,null,null,null,null,null,null,null,null,null,null,null,null,null,null,null,null,null,null,null,null,null,null,null,"2012-01-03","2008-12-10"]
[null,null,null,null,null,null,null,null,null,null,null,null,null,null,null,null,null,null,null,null,null,null,null,null,null,null,null,null,null,null,null,null,null,null,null,null,null,null,null,null,null,null,null,null,null,null,null,null,null,null,null,null,null,null,null,null,null,null,null,null,null,"2012-01-04","2008-12-11"]
[null,null,null,null,null,null,null,null,null,null,null,null,null,null,null,null,null,null,null,null,null,null,null,null,null,null,null,null,null,null,null,null,null,null,null,null,null,null,null,null,null,null,null,null,null,null,null,null,null,null,null,null,null,null,null,null,null,null,null,null,null,"2012-01-05","2008-12-12"]
[null,null,null,null,null,null,null,null,null,null,null,null,null,null,null,null,null,null,null,null,null,null,null,null,null,null,null,null,null,null,null,null,null,null,null,null,null,null,null,null,null,null,null,null,null,null,null,null,null,null,null,null,null,null,null,null,null,null,null,null,null,"2012-01-06","2008-12-13"]
[null,null,null,null,null,null,null,null,null,null,null,null,null,null,null,null,null,null,null,null,null,null,null,null,null,null,null,null,null,null,null,null,null,null,null,null,null,null,null,null,null,null,null,null,null,null,null,null,null,null,null,null,null,null,null,null,null,null,null,null,null,"2012-01-07","2008-12-14"]
[null,null,null,null,null,null,null,null,null,null,null,null,null,null,null,null,null,null,null,null,null,null,null,null,null,null,null,null,null,null,null,null,null,null,null,null,null,null,null,null,null,null,null,null,null,null,null,null,null,null,null,null,null,null,null,null,null,null,null,null,null,"2012-01-08","2008-12-15"]
[null,null,null,null,null,null,null,null,null,null,null,null,null,null,null,null,null,null,null,null,null,null,null,null,null,null,null,null,null,null,null,null,null,null,null,null,null,null,null,null,null,null,null,null,null,null,null,null,null,null,null,null,null,null,null,null,null,null,null,null,null,"2012-01-09","2008-12-16"]
[null,null,null,null,null,null,null,null,null,null,null,null,null,null,null,null,null,null,null,null,null,null,null,null,null,null,null,null,null,null,null,null,null,null,null,null,null,null,null,null,null,null,null,null,null,null,null,null,null,null,null,null,null,null,null,null,null,null,null,null,null,"2012-01-10","2008-12-17"]
[null,null,null,null,null,null,null,null,null,null,null,null,null,null,null,null,null,null,null,null,null,null,null,null,null,null,null,null,null,null,null,null,null,null,null,null,null,null,null,null,null,null,null,null,null,null,null,null,null,null,null,null,null,null,null,null,null,null,null,null,null,"2012-01-11","2008-12-18"]
[null,null,null,null,null,null,null,null,null,null,null,null,null,null,null,null,null,null,null,null,null,null,null,null,null,null,null,null,null,null,null,null,null,null,null,null,null,null,null,null,null,null,null,null,null,null,null,null,null,null,null,null,null,null,null,null,null,null,null,null,null,"2012-01-12","2008-12-19"]
[null,null,null,null,null,null,null,null,null,null,null,null,null,null,null,null,null,null,null,null,null,null,null,null,null,null,null,null,null,null,null,null,null,null,null,null,null,null,null,null,null,null,null,null,null,null,null,null,null,null,null,null,null,null,null,null,null,null,null,null,null,"2012-01-13","2008-12-20"]
[null,null,null,null,null,null,null,null,null,null,null,null,null,null,null,null,null,null,null,null,null,null,null,null,null,null,null,null,null,null,null,null,null,null,null,null,null,null,null,null,null,null,null,null,null,null,null,null,null,null,null,null,null,null,null,null,null,null,null,null,null,"2012-01-14","2008-12-21"]
[null,null,null,null,null,null,null,null,null,null,null,null,null,null,null,null,null,null,null,null,null,null,null,null,null,null,null,null,null,null,null,null,null,null,null,null,null,null,null,null,null,null,null,null,null,null,null,null,null,null,null,null,null,null,null,null,null,null,null,null,null,"2012-01-15","2008-12-22"]
[null,null,null,null,null,null,null,null,null,null,null,null,null,null,null,null,null,null,null,null,null,null,null,null,null,null,null,null,null,null,null,null,null,null,null,null,null,null,null,null,null,null,null,null,null,null,null,null,null,null,null,null,null,null,null,null,null,null,null,null,null,"2012-01-16","2008-12-23"]
[null,null,null,null,null,null,null,null,null,null,null,null,null,null,null,null,null,null,null,null,null,null,null,null,null,null,null,null,null,null,null,null,null,null,null,null,null,null,null,null,null,null,null,null,null,null,null,null,null,null,null,null,null,null,null,null,null,null,null,null,null,"2012-01-17","2008-12-24"]
[null,null,null,null,null,null,null,null,null,null,null,null,null,null,null,null,null,null,null,null,null,null,null,null,null,null,null,null,null,null,null,null,null,null,null,null,null,null,null,null,null,null,null,null,null,null,null,null,null,null,null,null,null,null,null,null,null,null,null,null,null,"2012-01-18","2008-12-25"]
[null,null,null,null,null,null,null,null,null,null,null,null,null,null,null,null,null,null,null,null,null,null,null,null,null,null,null,null,null,null,null,null,null,null,null,null,null,null,null,null,null,null,null,null,null,null,null,null,null,null,null,null,null,null,null,null,null,null,null,null,null,"2012-01-19","2008-12-26"]
[null,null,null,null,null,null,null,null,null,null,null,null,null,null,null,null,null,null,null,null,null,null,null,null,null,null,null,null,null,null,null,null,null,null,null,null,null,null,null,null,null,null,null,null,null,null,null,null,null,null,null,null,null,null,null,null,null,null,null,null,null,"2012-01-20","2008-12-27"]
[null,null,null,null,null,null,null,null,null,null,null,null,null,null,null,null,null,null,null,null,null,null,null,null,null,null,null,null,null,null,null,null,null,null,null,null,null,null,null,null,null,null,null,null,null,null,null,null,null,null,null,null,null,null,null,null,null,null,null,null,null,"2012-01-21","2008-12-28"]
[null,null,null,null,null,null,null,null,null,null,null,null,null,null,null,null,null,null,null,null,null,null,null,null,null,null,null,null,null,null,null,null,null,null,null,null,null,null,null,null,null,null,null,null,null,null,null,null,null,null,null,null,null,null,null,null,null,null,null,null,null,"2012-01-22","2008-12-29"]
[null,null,null,null,null,null,null,null,null,null,null,null,null,null,null,null,null,null,null,null,null,null,null,null,null,null,null,null,null,null,null,null,null,null,null,null,null,null,null,null,null,null,null,null,null,null,null,null,null,null,null,null,null,null,null,null,null,null,null,null,null,"2012-01-23","2008-12-30"]
[null,null,null,null,null,null,null,null,null,null,null,null,null,null,null,null,null,null,null,null,null,null,null,null,null,null,null,null,null,null,null,null,null,null,null,null,null,null,null,null,null,null,null,null,null,null,null,null,null,null,null,null,null,null,null,null,null,null,null,null,null,"2012-01-24","2008-12-31"]
[null,null,null,null,null,null,null,null,null,null,null,null,null,null,null,null,null,null,null,null,null,null,null,null,null,null,null,null,null,null,null,null,null,null,null,null,null,null,null,null,null,null,null,null,null,null,null,null,null,null,null,null,null,null,null,null,null,null,null,null,null,"2012-01-25","2009-01-01"]
[null,null,null,null,null,null,null,null,null,null,null,null,null,null,null,null,null,null,null,null,null,null,null,null,null,null,null,null,null,null,null,null,null,null,null,null,null,null,null,null,null,null,null,null,null,null,null,null,null,null,null,null,null,null,null,null,null,null,null,null,null,"2012-01-26","2009-01-02"]
[null,null,null,null,null,null,null,null,null,null,null,null,null,null,null,null,null,null,null,null,null,null,null,null,null,null,null,null,null,null,null,null,null,null,null,null,null,null,null,null,null,null,null,null,null,null,null,null,null,null,null,null,null,null,null,null,null,null,null,null,null,"2012-01-27","2009-01-03"]
[null,null,null,null,null,null,null,null,null,null,null,null,null,null,null,null,null,null,null,null,null,null,null,null,null,null,null,null,null,null,null,null,null,null,null,null,null,null,null,null,null,null,null,null,null,null,null,null,null,null,null,null,null,null,null,null,null,null,null,null,null,"2012-01-28","2009-01-04"]
[null,null,null,null,null,null,null,null,null,null,null,null,null,null,null,null,null,null,null,null,null,null,null,null,null,null,null,null,null,null,null,null,null,null,null,null,null,null,null,null,null,null,null,null,null,null,null,null,null,null,null,null,null,null,null,null,null,null,null,null,null,"2012-01-29","2009-01-05"]
[null,null,1,2,3,4,5,6,7,8,9,10,11,12,13,14,15,16,17,18,19,20,21,22,23,null,null,null,null,null,null,null,null,null,null,null,null,null,null,null,null,null,null,null,null,null,null,null,null,null,null,null,null,null,null,null,null,null,null,null,null,"2012-01-30","2009-01-06"]
[null,null,null,null,null,"already drawn","tobr drawn","d.a.","h.r.a,stt","hra","days in month",null,null,"a d b amount","t d b amount","da","hra","td da","tb hra",null,null,null,null,null,null,null,null,null,null,null,null,null,null,null,null,null,null,null,null,null,null,null,null,null,null,null,null,null,null,null,null,null,null,null,null,null,null,null,null,null,null,"2012-01-31","2009-01-07"]
[null,0,0,0,0,0,0,0,0,0,0,0,0,0,0,0,0,0,0,{"$f":"E34","v":0},{"$f":"E35","v":0},0,0,0,0,0,0,null,null,null,null,null,null,null,null,null,null,null,null,null,null,null,null,null,null,null,null,null,null,null,null,null,null,null,null,null,null,null,null,null,null,"2012-02-01","2009-01-08"]
[null,1,{"$f":"BE164","v":"2010-02-01"},{"$f":"ROUND(E244-C244+1,0)","v":28},{"$f":"IF(C245=0,BA164,C245-1)","v":"2010-02-28"},{"$f":"VLOOKUP(C244,F71:G78,2,TRUE)","v":14440},{"$f":"VLOOKUP(C244,F81:G88,2,TRUE)","v":14860},{"$f":"VLOOKUP(C244,AM64:AO68,3,TRUE)","v":16.263999999999999},{"$f":"IF(C244<E136,IF(C244<AO71,AO69,AN69),IF(C244<AO71,AO70,AN70))","v":10},{"$f":"IF(C244=0,0,I244)","v":10},{"$f":"VLOOKUP(MONTH(C244),M125:N136,2,TRUE)","v":28},null,null,{"$f":"ROUND(F244*D244/K244,0)","v":14440},{"$f":"ROUND(G244*D244/K244,0)","v":14860},{"$f":"ROUND(N244*H244%,0)","v":2349},{"$f":"ROUND(N244*J244%,0)","v":1444},{"$f":"ROUND(O244*H244%,0)","v":2417},{"$f":"ROUND(O244*I244%,0)","v":1486},{"$f":"ROUND(E34*D244/K244,0)","v":0},{"$f":"ROUND(E34*D244/K244,0)","v":0},null,{"$f":"C244","v":"2010-02-01"},{"$f":"40695","v":40695},1,{"$f":"VLOOKUP(C244,BILL!D5:N26,11,TRUE)","v":150},null,null,null,null,null,null,null,null,null,null,null,null,null,null,null,null,null,null,null,null,null,null,null,null,null,null,null,null,null,null,null,null,null,null,null,"2012-02-02","2009-01-09"]
[null,2,{"$f":"IF(BF165=C244,C244,BF165)","v":"2010-03-01"},{"$f":"ROUND(IF(C245=0,0,E245-C245+1),0)","v":31},"2010-03-31",{"$f":"VLOOKUP(C245,F71:G78,2,TRUE)","v":14440},{"$f":"VLOOKUP(C245,F81:G88,2,TRUE)","v":14860},{"$f":"VLOOKUP(C245,AM64:AO68,3,TRUE)","v":16.263999999999999},{"$f":"IF(C245<E136,IF(C245<AO71,AO69,AN69),IF(C245<AO71,AO70,AN70))","v":10},10,{"$f":"VLOOKUP(MONTH(C245),M125:N136,2,TRUE)","v":31},null,null,{"$f":"ROUND(F245*D245/K245,0)","v":14440},14860,2349,{"$f":"ROUND(N245*J245%,0)","v":1444},2417,{"$f":"ROUND(O245*I245%,0)","v":1486},{"$f":"ROUND(E34*D245/K245,0)","v":0},{"$f":"ROUND(E35*D245/K245,0)","v":0},null,{"$f":"IF(C245=0,W244+1,C245)","v":"2010-03-01"},{"$f":"X244","v":"2011-06-01"},2,{"$f":"VLOOKUP(C245,BILL!D6:N27,11,TRUE)","v":150},null,null,null,null,null,null,null,null,null,null,null,null,null,null,null,null,null,null,null,null,null,null,null,null,null,null,null,null,null,null,null,null,null,null,null,"2012-02-03","2009-01-10"]
[null,3,{"$f":"BG166","v":"2010-04-01"},{"$f":"ROUND(IF(C246=0,0,E246-C246+1),0)","v":30},"2010-04-30",{"$f":"VLOOKUP(C246,F71:G78,2,TRUE)","v":14440},{"$f":"VLOOKUP(C246,F81:G88,2,TRUE)","v":14860},{"$f":"VLOOKUP(C246,AM64:AO68,3,TRUE)","v":16.263999999999999},{"$f":"IF(C246<E136,IF(C246<AO71,AO69,AN69),IF(C246<AO71,AO70,AN70))","v":10},10,{"$f":"VLOOKUP(MONTH(C246),M125:N136,2,TRUE)","v":30},null,null,14440,14860,2349,1444,2417,1486,{"$f":"ROUND(E34*D246/K246,0)","v":0},{"$f":"ROUND(E35*D246/K246,0)","v":0},null,{"$f":"IF(C246=0,W245+1,C246)","v":"2010-04-01"},{"$f":"X245","v":"2011-06-01"},3,{"$f":"VLOOKUP(C246,BILL!D7:N28,11,TRUE)","v":150},null,null,null,null,null,null,null,null,null,null,null,null,null,null,null,null,null,null,null,null,null,null,null,null,null,null,null,null,null,null,null,null,null,null,null,"2012-02-04","2009-01-11"]
[null,4,{"$f":"BH167","v":"2010-05-01"},31,"2010-05-31",{"$f":"VLOOKUP(C247,F71:G78,2,TRUE)","v":14440},{"$f":"VLOOKUP(C247,F81:G88,2,TRUE)","v":14860},{"$f":"VLOOKUP(C247,AM64:AO68,3,TRUE)","v":16.263999999999999},{"$f":"IF(C247<E136,IF(C247<AO71,AO69,AN69),IF(C247<AO71,AO70,AN70))","v":10},10,{"$f":"VLOOKUP(MONTH(C247),M125:N136,2,TRUE)","v":31},null,null,14440,14860,2349,1444,2417,1486,{"$f":"ROUND(E34*D247/K247,0)","v":0},{"$f":"ROUND(E35*D247/K247,0)","v":0},null,"2010-05-01","2011-06-01",4,{"$f":"VLOOKUP(C247,BILL!D8:N29,11,TRUE)","v":150},null,null,null,null,null,null,null,null,null,null,null,null,null,null,null,null,null,null,null,null,null,null,null,null,null,null,null,null,null,null,null,null,null,null,null,"2012-02-05","2009-01-12"]
[null,5,{"$f":"BQ168","v":"2010-06-01"},30,"2010-06-30",{"$f":"VLOOKUP(C248,F71:G78,2,TRUE)","v":14440},{"$f":"VLOOKUP(C248,F81:G88,2,TRUE)","v":14860},{"$f":"VLOOKUP(C248,AM64:AO68,3,TRUE)","v":16.263999999999999},{"$f":"IF(C248<E136,IF(C248<AO71,AO69,AN69),IF(C248<AO71,AO70,AN70))","v":10},10,{"$f":"VLOOKUP(MONTH(C248),M125:N136,2,TRUE)","v":30},null,null,14440,14860,2349,1444,2417,1486,{"$f":"ROUND(E34*D248/K248,0)","v":0},{"$f":"ROUND(E35*D248/K248,0)","v":0},null,"2010-06-01","2011-06-01",5,{"$f":"VLOOKUP(C248,BILL!D9:N30,11,TRUE)","v":150},null,null,null,null,null,null,null,null,null,null,null,null,null,null,null,null,null,null,null,null,null,null,null,null,null,null,null,null,null,null,null,null,null,null,null,"2012-02-06","2009-01-13"]
[null,6,{"$f":"BR169","v":"2010-07-01"},31,"2010-07-31",{"$f":"VLOOKUP(C249,F71:G78,2,TRUE)","v":14440},{"$f":"VLOOKUP(C249,F81:G88,2,TRUE)","v":14860},{"$f":"VLOOKUP(C249,AM64:AO68,3,TRUE)","v":24.824000000000002},{"$f":"IF(C249<E136,IF(C249<AO71,AO69,AN69),IF(C249<AO71,AO70,AN70))","v":10},10,{"$f":"VLOOKUP(MONTH(C249),M125:N136,2,TRUE)","v":31},null,null,14440,14860,3585,1444,3689,1486,{"$f":"ROUND(E34*D249/K249,0)","v":0},{"$f":"ROUND(E35*D249/K249,0)","v":0},null,"2010-07-01","2011-06-01",6,{"$f":"VLOOKUP(C249,BILL!D10:N31,11,TRUE)","v":200},null,null,null,null,null,null,null,null,null,null,null,null,null,null,null,null,null,null,null,null,null,null,null,null,null,null,null,null,null,null,null,null,null,null,null,"2012-02-07","2009-01-14"]
[null,7,{"$f":"BS170","v":"2010-08-01"},31,"2010-08-31",{"$f":"VLOOKUP(C250,F71:G78,2,TRUE)","v":14860},{"$f":"VLOOKUP(C250,F81:G88,2,TRUE)","v":15280},{"$f":"VLOOKUP(C250,AM64:AO68,3,TRUE)","v":24.824000000000002},{"$f":"IF(C250<E136,IF(C250<AO71,AO69,AN69),IF(C250<AO71,AO70,AN70))","v":10},10,{"$f":"VLOOKUP(MONTH(C250),M125:N136,2,TRUE)","v":31},null,null,14860,15280,3689,1486,3793,1528,{"$f":"ROUND(E34*D250/K250,0)","v":0},{"$f":"ROUND(E35*D250/K250,0)","v":0},null,"2010-08-01","2011-06-01",7,{"$f":"VLOOKUP(C250,BILL!D11:N32,11,TRUE)","v":0},null,null,null,null,null,null,null,null,null,null,null,null,null,null,null,null,null,null,null,null,null,null,null,null,null,null,null,null,null,null,null,null,null,null,null,"2012-02-08","2009-01-15"]
[null,8,{"$f":"BT171","v":"2010-09-01"},30,"2010-09-30",{"$f":"VLOOKUP(C251,F71:G78,2,TRUE)","v":14860},{"$f":"VLOOKUP(C251,F81:G88,2,TRUE)","v":15280},{"$f":"VLOOKUP(C251,AM64:AO68,3,TRUE)","v":24.824000000000002},{"$f":"IF(C251<E136,IF(C251<AO71,AO69,AN69),IF(C251<AO71,AO70,AN70))","v":10},10,{"$f":"VLOOKUP(MONTH(C251),M125:N136,2,TRUE)","v":30},null,null,14860,15280,3689,1486,3793,1528,{"$f":"ROUND(E34*D251/K251,0)","v":0},{"$f":"ROUND(E35*D251/K251,0)","v":0},null,"2010-09-01","2011-06-01",8,{"$f":"VLOOKUP(C251,BILL!D12:N33,11,TRUE)","v":0},null,null,null,null,null,null,null,null,null,null,null,null,null,null,null,null,null,null,null,null,null,null,null,null,null,null,null,null,null,null,null,null,null,null,null,"2012-02-09","2009-01-16"]
[null,9,{"$f":"BU172","v":"2010-10-01"},31,"2010-10-31",{"$f":"VLOOKUP(C252,F71:G78,2,TRUE)","v":14860},{"$f":"VLOOKUP(C252,F81:G88,2,TRUE)","v":15280},{"$f":"VLOOKUP(C252,AM64:AO68,3,TRUE)","v":24.824000000000002},{"$f":"IF(C252<E136,IF(C252<AO71,AO69,AN69),IF(C252<AO71,AO70,AN70))","v":10},10,{"$f":"VLOOKUP(MONTH(C252),M125:N136,2,TRUE)","v":31},null,null,14860,15280,3689,1486,3793,1528,{"$f":"ROUND(E34*D252/K252,0)","v":0},{"$f":"ROUND(E35*D252/K252,0)","v":0},null,"2010-10-01","2011-06-01",9,{"$f":"VLOOKUP(C252,BILL!D13:N34,11,TRUE)","v":0},null,null,null,null,null,null,null,null,null,null,null,null,null,null,null,null,null,null,null,null,null,null,null,null,null,null,null,null,null,null,null,null,null,null,null,"2012-02-10","2009-01-17"]
[null,10,{"$f":"BV173","v":"2010-11-01"},30,"2010-11-30",{"$f":"VLOOKUP(C253,F71:G78,2,TRUE)","v":14860},{"$f":"VLOOKUP(C253,F81:G88,2,TRUE)","v":15280},{"$f":"VLOOKUP(C253,AM64:AO68,3,TRUE)","v":24.824000000000002},{"$f":"IF(C253<E136,IF(C253<AO71,AO69,AN69),IF(C253<AO71,AO70,AN70))","v":10},10,{"$f":"VLOOKUP(MONTH(C253),M125:N136,2,TRUE)","v":30},null,null,14860,15280,3689,1486,3793,1528,{"$f":"ROUND(E34*D253/K253,0)","v":0},{"$f":"ROUND(E35*D253/K253,0)","v":0},null,"2010-11-01","2011-06-01",10,{"$f":"VLOOKUP(C253,BILL!D14:N35,11,TRUE)","v":0},null,null,null,null,null,null,null,null,null,null,null,null,null,null,null,null,null,null,null,null,null,null,null,null,null,null,null,null,null,null,null,null,null,null,null,"2012-02-11","2009-01-18"]
[null,11,{"$f":"BW174","v":"2010-12-01"},31,"2010-12-31",{"$f":"VLOOKUP(C254,F71:G78,2,TRUE)","v":14860},{"$f":"VLOOKUP(C254,F81:G88,2,TRUE)","v":15280},{"$f":"VLOOKUP(C254,AM64:AO68,3,TRUE)","v":24.824000000000002},{"$f":"IF(C254<E136,IF(C254<AO71,AO69,AN69),IF(C254<AO71,AO70,AN70))","v":10},10,{"$f":"VLOOKUP(MONTH(C254),M125:N136,2,TRUE)","v":31},null,null,14860,15280,3689,1486,3793,1528,{"$f":"ROUND(E34*D254/K254,0)","v":0},{"$f":"ROUND(E35*D254/K254,0)","v":0},null,"2010-12-01","2011-06-01",11,{"$f":"VLOOKUP(C254,BILL!D15:N36,11,TRUE)","v":0},null,null,null,null,null,null,null,null,null,null,null,null,null,null,null,null,null,null,null,null,null,null,null,null,null,null,null,null,null,null,null,null,null,null,null,"2012-02-12","2009-01-19"]
[null,12,{"$f":"BX175","v":"2011-01-01"},31,"2011-01-31",{"$f":"VLOOKUP(C255,F71:G78,2,TRUE)","v":14860},{"$f":"VLOOKUP(C255,F81:G88,2,TRUE)","v":15280},{"$f":"VLOOKUP(C255,AM64:AO68,3,TRUE)","v":29.96},{"$f":"IF(C255<E136,IF(C255<AO71,AO69,AN69),IF(C255<AO71,AO70,AN70))","v":10},10,{"$f":"VLOOKUP(MONTH(C255),M125:N136,2,TRUE)","v":31},null,null,14860,15280,4452,1486,4578,1528,{"$f":"ROUND(E34*D255/K255,0)","v":0},{"$f":"ROUND(E35*D255/K255,0)","v":0},null,"2011-01-01","2011-06-01",12,{"$f":"VLOOKUP(C255,BILL!D16:N37,11,TRUE)","v":0},null,null,null,null,null,null,null,null,null,null,null,null,null,null,null,null,null,null,null,null,null,null,null,null,null,null,null,null,null,null,null,null,null,null,null,"2012-02-13","2009-01-20"]
[null,13,{"$f":"BY176","v":"2011-02-01"},28,"2011-02-28",{"$f":"VLOOKUP(C256,F71:G78,2,TRUE)","v":14860},{"$f":"VLOOKUP(C256,F81:G88,2,TRUE)","v":15280},{"$f":"VLOOKUP(C256,AM64:AO68,3,TRUE)","v":29.96},{"$f":"IF(C256<E136,IF(C256<AO71,AO69,AN69),IF(C256<AO71,AO70,AN70))","v":10},10,{"$f":"VLOOKUP(MONTH(C256),M125:N136,2,TRUE)","v":28},null,null,14860,15280,4452,1486,4578,1528,{"$f":"ROUND(E34*D256/K256,0)","v":0},{"$f":"ROUND(E35*D256/K256,0)","v":0},null,"2011-02-01","2011-06-01",13,{"$f":"VLOOKUP(C256,BILL!D17:N38,11,TRUE)","v":0},null,null,null,null,null,null,null,null,null,null,null,null,null,null,null,null,null,null,null,null,null,null,null,null,null,null,null,null,null,null,null,null,null,null,null,"2012-02-14","2009-01-21"]
[null,14,{"$f":"BZ177","v":"2011-03-01"},31,"2011-03-31",{"$f":"VLOOKUP(C257,F71:G78,2,TRUE)","v":14860},{"$f":"VLOOKUP(C257,F81:G88,2,TRUE)","v":15280},{"$f":"VLOOKUP(C257,AM64:AO68,3,TRUE)","v":29.96},{"$f":"IF(C257<E136,IF(C257<AO71,AO69,AN69),IF(C257<AO71,AO70,AN70))","v":10},10,{"$f":"VLOOKUP(MONTH(C257),M125:N136,2,TRUE)","v":31},null,null,14860,15280,4452,1486,4578,1528,{"$f":"ROUND(E34*D257/K257,0)","v":0},{"$f":"ROUND(E35*D257/K257,0)","v":0},null,"2011-03-01","2011-06-01",14,{"$f":"VLOOKUP(C257,BILL!D18:N39,11,TRUE)","v":0},null,null,null,null,null,null,null,null,null,null,null,null,null,null,null,null,null,null,null,null,null,null,null,null,null,null,null,null,null,null,null,null,null,null,null,"2012-02-15","2009-01-22"]
[null,15,{"$f":"CA178","v":"2011-04-01"},30,"2011-04-30",{"$f":"VLOOKUP(C258,F71:G78,2,TRUE)","v":14860},{"$f":"VLOOKUP(C258,F81:G88,2,TRUE)","v":15280},{"$f":"VLOOKUP(C258,AM64:AO68,3,TRUE)","v":29.96},{"$f":"IF(C258<E136,IF(C258<AO71,AO69,AN69),IF(C258<AO71,AO70,AN70))","v":12},12,{"$f":"VLOOKUP(MONTH(C258),M125:N136,2,TRUE)","v":30},null,null,14860,15280,4452,1783,4578,1834,{"$f":"ROUND(E34*D258/K258,0)","v":0},{"$f":"ROUND(E35*D258/K258,0)","v":0},null,"2011-04-01","2011-06-01",15,{"$f":"VLOOKUP(C258,BILL!D19:N40,11,TRUE)","v":0},null,null,null,null,null,null,null,null,null,null,null,null,null,null,null,null,null,null,null,null,null,null,null,null,null,null,null,null,null,null,null,null,null,null,null,"2012-02-16","2009-01-23"]
[null,16,{"$f":"CB179","v":"2011-05-01"},31,"2011-05-31",{"$f":"VLOOKUP(C259,F71:G78,2,TRUE)","v":14860},{"$f":"VLOOKUP(C259,F81:G88,2,TRUE)","v":15280},{"$f":"VLOOKUP(C259,AM64:AO68,3,TRUE)","v":29.96},{"$f":"IF(C259<E136,IF(C259<AO71,AO69,AN69),IF(C259<AO71,AO70,AN70))","v":12},12,{"$f":"VLOOKUP(MONTH(C259),M125:N136,2,TRUE)","v":31},null,null,14860,15280,4452,1783,4578,1834,{"$f":"ROUND(E34*D259/K259,0)","v":0},{"$f":"ROUND(E35*D259/K259,0)","v":0},null,"2011-05-01","2011-06-01",16,{"$f":"VLOOKUP(C259,BILL!D20:N41,11,TRUE)","v":0},null,null,null,null,null,null,null,null,null,null,null,null,null,null,null,null,null,null,null,null,null,null,null,null,null,null,null,null,null,null,null,null,null,null,null,"2012-02-17","2009-01-24"]
[null,17,{"$f":"CC180","v":"2011-06-01"},30,"2011-06-30",{"$f":"VLOOKUP(C260,F71:G78,2,TRUE)","v":14860},{"$f":"VLOOKUP(C260,F81:G88,2,TRUE)","v":15280},{"$f":"VLOOKUP(C260,AM64:AO68,3,TRUE)","v":29.96},{"$f":"IF(C260<E136,IF(C260<AO71,AO69,AN69),IF(C260<AO71,AO70,AN70))","v":12},12,{"$f":"VLOOKUP(MONTH(C260),M125:N136,2,TRUE)","v":30},null,null,14860,15280,4452,1783,4578,1834,{"$f":"ROUND(E34*D260/K260,0)","v":0},{"$f":"ROUND(E35*D260/K260,0)","v":0},null,"2011-06-01","2011-06-01",17,{"$f":"VLOOKUP(C260,BILL!D21:N42,11,TRUE)","v":200},null,null,null,null,null,null,null,null,null,null,null,null,null,null,null,null,null,null,null,null,null,null,null,null,null,null,null,null,null,null,null,null,null,null,null,"2012-02-18","2009-01-25"]
[null,18,{"$f":"CD181","v":"2011-07-01"},30,"2011-07-30T00:14:24",{"$f":"VLOOKUP(C261,F71:G78,2,TRUE)","v":14860},{"$f":"VLOOKUP(C261,F81:G88,2,TRUE)","v":15280},{"$f":"VLOOKUP(C261,AM64:AO68,3,TRUE)","v":29.96},{"$f":"IF(C261<E136,IF(C261<AO71,AO69,AN69),IF(C261<AO71,AO70,AN70))","v":12},12,{"$f":"VLOOKUP(MONTH(C261),M125:N136,2,TRUE)","v":31},null,null,14381,14787,4309,1726,4430,1774,{"$f":"ROUND(E34*D261/K261,0)","v":0},{"$f":"ROUND(E35*D261/K261,0)","v":0},null,"2011-07-01","2011-06-01",18,{"$f":"VLOOKUP(C261,BILL!D22:N43,11,TRUE)","v":0},null,null,null,null,null,null,null,null,null,null,null,null,null,null,null,null,null,null,null,null,null,null,null,null,null,null,null,null,null,null,null,null,null,null,null,"2012-02-19","2009-01-26"]
[null,19,{"$f":"CE182","v":"00:00:00"},0,"2011-07-30T00:14:24",{"$f":"VLOOKUP(C262,F71:G78,2,TRUE)","v":{"$error":"#N/A"}},{"$f":"VLOOKUP(C262,F81:G88,2,TRUE)","v":{"$error":"#N/A"}},{"$f":"VLOOKUP(C262,AM64:AO68,3,TRUE)","v":0},{"$f":"IF(C262<E136,IF(C262<AO71,AO69,AN69),IF(C262<AO71,AO70,AN70))","v":10},0,{"$f":"VLOOKUP(MONTH(C262),M125:N136,2,TRUE)","v":31},null,null,{"$error":"#N/A"},{"$error":"#N/A"},{"$error":"#N/A"},{"$error":"#N/A"},{"$error":"#N/A"},{"$error":"#N/A"},{"$f":"ROUND(E34*D262/K262,0)","v":0},{"$f":"ROUND(E35*D262/K262,0)","v":0},null,"2011-07-02","2011-06-01",19,{"$f":"VLOOKUP(C262,BILL!D23:N44,11,TRUE)","v":0},null,null,null,null,null,null,null,null,null,null,null,null,null,null,null,null,null,null,null,null,null,null,null,null,null,null,null,null,null,null,null,null,null,null,null,"2012-02-20","2009-01-27"]
[null,20,{"$f":"CF183","v":"00:00:00"},0,"2011-07-30T00:14:24",{"$f":"VLOOKUP(C263,F71:G78,2,TRUE)","v":{"$error":"#N/A"}},{"$f":"VLOOKUP(C263,F81:G88,2,TRUE)","v":{"$error":"#N/A"}},{"$f":"VLOOKUP(C263,AM64:AO68,3,TRUE)","v":0},{"$f":"IF(C263<E136,IF(C263<AO71,AO69,AN69),IF(C263<AO71,AO70,AN70))","v":10},0,{"$f":"VLOOKUP(MONTH(C263),M125:N136,2,TRUE)","v":31},null,null,{"$error":"#N/A"},{"$error":"#N/A"},{"$error":"#N/A"},{"$error":"#N/A"},{"$error":"#N/A"},{"$error":"#N/A"},{"$f":"ROUND(E34*D263/K263,0)","v":0},{"$f":"ROUND(E35*D263/K263,0)","v":0},null,"2011-07-03","2011-06-01",20,{"$f":"VLOOKUP(C263,BILL!D24:N45,11,TRUE)","v":0},null,null,null,null,null,null,null,null,null,null,null,null,null,null,null,null,null,null,null,null,null,null,null,null,null,null,null,null,null,null,null,null,null,null,null,"2012-02-21","2009-01-28"]
[null,21,{"$f":"CG184","v":"00:00:00"},0,"2011-07-30T00:14:24",{"$f":"VLOOKUP(C264,F71:G78,2,TRUE)","v":{"$error":"#N/A"}},{"$f":"VLOOKUP(C264,F81:G88,2,TRUE)","v":{"$error":"#N/A"}},{"$f":"VLOOKUP(C264,AM64:AO68,3,TRUE)","v":0},{"$f":"IF(C264<E136,IF(C264<AO71,AO69,AN69),IF(C264<AO71,AO70,AN70))","v":10},0,{"$f":"VLOOKUP(MONTH(C264),M125:N136,2,TRUE)","v":31},null,null,{"$error":"#N/A"},{"$error":"#N/A"},{"$error":"#N/A"},{"$error":"#N/A"},{"$error":"#N/A"},{"$error":"#N/A"},{"$f":"ROUND(E34*D264/K264,0)","v":0},{"$f":"ROUND(E35*D264/K264,0)","v":0},null,"2011-07-04","2011-06-01",21,{"$f":"VLOOKUP(C264,BILL!D25:N46,11,TRUE)","v":0},null,null,null,null,null,null,null,null,null,null,null,null,null,null,null,null,null,null,null,null,null,null,null,null,null,null,null,null,null,null,null,null,null,null,null,"2012-02-22","2009-01-29"]
[null,22,{"$f":"CH185","v":"00:00:00"},0,"2011-07-30T00:14:24",{"$f":"VLOOKUP(C265,F71:G78,2,TRUE)","v":{"$error":"#N/A"}},{"$f":"VLOOKUP(C265,F81:G88,2,TRUE)","v":{"$error":"#N/A"}},{"$f":"VLOOKUP(C265,AM64:AO68,3,TRUE)","v":0},{"$f":"IF(C265<E136,IF(C265<AO71,AO69,AN69),IF(C265<AO71,AO70,AN70))","v":10},0,{"$f":"VLOOKUP(MONTH(C265),M125:N136,2,TRUE)","v":31},null,null,{"$error":"#N/A"},{"$error":"#N/A"},{"$error":"#N/A"},{"$error":"#N/A"},{"$error":"#N/A"},{"$error":"#N/A"},{"$f":"ROUND(E34*D265/K265,0)","v":0},{"$f":"ROUND(E35*D265/K265,0)","v":0},null,"2011-07-05","2011-06-01",22,{"$f":"VLOOKUP(C265,BILL!D26:N47,11,TRUE)","v":0},null,null,null,null,null,null,null,null,null,null,null,null,null,null,null,null,null,null,null,null,null,null,null,null,null,null,null,null,null,null,null,null,null,null,null,"2012-02-23","2009-01-30"]
[null,23,{"$f":"CI186","v":"00:00:00"},0,"2011-07-30T00:14:24",{"$f":"VLOOKUP(C266,F71:G78,2,TRUE)","v":{"$error":"#N/A"}},{"$f":"VLOOKUP(C266,F81:G88,2,TRUE)","v":{"$error":"#N/A"}},{"$f":"VLOOKUP(C266,AM64:AO68,3,TRUE)","v":0},{"$f":"IF(C266<E136,IF(C266<AO71,AO69,AN69),IF(C266<AO71,AO70,AN70))","v":10},0,{"$f":"VLOOKUP(MONTH(C266),M125:N136,2,TRUE)","v":31},null,null,{"$error":"#N/A"},{"$error":"#N/A"},{"$error":"#N/A"},{"$error":"#N/A"},{"$error":"#N/A"},{"$error":"#N/A"},{"$f":"ROUND(E34*D266/K266,0)","v":0},{"$f":"ROUND(E35*D266/K266,0)","v":0},null,"2011-07-06","2011-06-01",23,{"$f":"VLOOKUP(C266,BILL!D27:N48,11,TRUE)","v":0},null,null,null,null,null,null,null,null,null,null,null,null,null,null,null,null,null,null,null,null,null,null,null,null,null,null,null,null,null,null,null,null,null,null,null,"2012-02-24","2009-01-31"]
[null,24,{"$f":"CJ187","v":"00:00:00"},0,"2011-07-30T00:14:24",{"$f":"VLOOKUP(C267,F71:G78,2,TRUE)","v":{"$error":"#N/A"}},{"$f":"VLOOKUP(C267,F81:G88,2,TRUE)","v":{"$error":"#N/A"}},{"$f":"VLOOKUP(C267,AM64:AO68,3,TRUE)","v":0},{"$f":"IF(C267<E136,IF(C267<AO71,AO69,AN69),IF(C267<AO71,AO70,AN70))","v":10},0,{"$f":"VLOOKUP(MONTH(C267),M125:N136,2,TRUE)","v":31},null,null,{"$error":"#N/A"},{"$error":"#N/A"},{"$error":"#N/A"},{"$error":"#N/A"},{"$error":"#N/A"},{"$error":"#N/A"},{"$f":"ROUND(E34*D267/K267,0)","v":0},{"$f":"ROUND(E35*D267/K267,0)","v":0},null,"2011-07-07","2011-06-01",24,{"$f":"VLOOKUP(C267,BILL!D28:N49,11,TRUE)","v":0},null,null,null,null,null,null,null,null,null,null,null,null,null,null,null,null,null,null,null,null,null,null,null,null,null,null,null,null,null,null,null,null,null,null,null,"2012-02-25","2009-02-01"]
[null,25,{"$f":"CK188","v":"00:00:00"},0,"2011-07-30T00:14:24",{"$f":"VLOOKUP(C268,F71:G78,2,TRUE)","v":{"$error":"#N/A"}},{"$f":"VLOOKUP(C268,F81:G88,2,TRUE)","v":{"$error":"#N/A"}},{"$f":"VLOOKUP(C268,AM64:AO68,3,TRUE)","v":0},{"$f":"IF(C268<E136,IF(C268<AO71,AO69,AN69),IF(C268<AO71,AO70,AN70))","v":10},0,{"$f":"VLOOKUP(MONTH(C268),M125:N136,2,TRUE)","v":31},null,null,{"$error":"#N/A"},{"$error":"#N/A"},{"$error":"#N/A"},{"$error":"#N/A"},{"$error":"#N/A"},{"$error":"#N/A"},{"$f":"ROUND(E34*D268/K268,0)","v":0},{"$f":"ROUND(E35*D268/K268,0)","v":0},null,"2011-07-08","2011-06-01",25,{"$f":"VLOOKUP(C268,BILL!D29:N50,11,TRUE)","v":0},null,null,null,null,null,null,null,null,null,null,null,null,null,null,null,null,null,null,null,null,null,null,null,null,null,null,null,null,null,null,null,null,null,null,null,"2012-02-26","2009-02-02"]
[null,26,{"$f":"CL189","v":"00:00:00"},0,"2011-07-30T00:14:24",{"$f":"VLOOKUP(C269,F71:G78,2,TRUE)","v":{"$error":"#N/A"}},{"$f":"VLOOKUP(C269,F81:G88,2,TRUE)","v":{"$error":"#N/A"}},{"$f":"VLOOKUP(C269,AM64:AO68,3,TRUE)","v":0},{"$f":"IF(C269<E136,IF(C269<AO71,AO69,AN69),IF(C269<AO71,AO70,AN70))","v":10},0,{"$f":"VLOOKUP(MONTH(C269),M125:N136,2,TRUE)","v":31},null,null,{"$error":"#N/A"},{"$error":"#N/A"},{"$error":"#N/A"},{"$error":"#N/A"},{"$error":"#N/A"},{"$error":"#N/A"},{"$f":"ROUND(E34*D269/K269,0)","v":0},{"$f":"ROUND(E35*D269/K269,0)","v":0},null,"2011-07-09","2011-06-01",26,{"$f":"VLOOKUP(C269,BILL!D30:N51,11,TRUE)","v":0},null,null,null,null,null,null,null,null,null,null,null,null,null,null,null,null,null,null,null,null,null,null,null,null,null,null,null,null,null,null,null,null,null,null,null,"2012-02-27","2009-02-03"]
[null,27,{"$f":"CM190","v":"00:00:00"},0,"2011-07-30T00:14:24",{"$f":"VLOOKUP(C270,F71:G78,2,TRUE)","v":{"$error":"#N/A"}},{"$f":"VLOOKUP(C270,F81:G88,2,TRUE)","v":{"$error":"#N/A"}},{"$f":"VLOOKUP(C270,AM64:AO68,3,TRUE)","v":0},{"$f":"IF(C270<E136,IF(C270<AO71,AO69,AN69),IF(C270<AO71,AO70,AN70))","v":10},0,{"$f":"VLOOKUP(MONTH(C270),M125:N136,2,TRUE)","v":31},null,null,{"$error":"#N/A"},{"$error":"#N/A"},{"$error":"#N/A"},{"$error":"#N/A"},{"$error":"#N/A"},{"$error":"#N/A"},{"$f":"ROUND(E34*D270/K270,0)","v":0},{"$f":"ROUND(E35*D270/K270,0)","v":0},null,"2011-07-10","2011-06-01",27,{"$f":"VLOOKUP(C270,BILL!D31:N52,11,TRUE)","v":0},null,null,null,null,null,null,null,null,null,null,null,null,null,null,null,null,null,null,null,null,null,null,null,null,null,null,null,null,null,null,null,null,null,null,null,"2012-02-28","2009-02-04"]
[null,28,{"$f":"CN191","v":"00:00:00"},0,"2011-07-30T00:14:24",{"$f":"VLOOKUP(C271,F71:G78,2,TRUE)","v":{"$error":"#N/A"}},{"$f":"VLOOKUP(C271,F81:G88,2,TRUE)","v":{"$error":"#N/A"}},{"$f":"VLOOKUP(C271,AM64:AO68,3,TRUE)","v":0},{"$f":"IF(C271<E136,IF(C271<AO71,AO69,AN69),IF(C271<AO71,AO70,AN70))","v":10},0,{"$f":"VLOOKUP(MONTH(C271),M125:N136,2,TRUE)","v":31},null,null,{"$error":"#N/A"},{"$error":"#N/A"},{"$error":"#N/A"},{"$error":"#N/A"},{"$error":"#N/A"},{"$error":"#N/A"},{"$f":"ROUND(E34*D271/K271,0)","v":0},{"$f":"ROUND(E35*D271/K271,0)","v":0},null,"2011-07-11","2011-06-01",28,{"$f":"VLOOKUP(C271,BILL!D32:N53,11,TRUE)","v":0},null,null,null,null,null,null,null,null,null,null,null,null,null,null,null,null,null,null,null,null,null,null,null,null,null,null,null,null,null,null,null,null,null,null,null,"2012-02-29","2009-02-05"]
[null,29,{"$f":"CO192","v":"00:00:00"},0,"2011-07-30T00:14:24",{"$f":"VLOOKUP(C272,F71:G78,2,TRUE)","v":{"$error":"#N/A"}},{"$f":"VLOOKUP(C272,F81:G88,2,TRUE)","v":{"$error":"#N/A"}},{"$f":"VLOOKUP(C272,AM64:AO68,3,TRUE)","v":0},{"$f":"IF(C272<E136,IF(C272<AO71,AO69,AN69),IF(C272<AO71,AO70,AN70))","v":10},0,{"$f":"VLOOKUP(MONTH(C272),M125:N136,2,TRUE)","v":31},null,null,{"$error":"#N/A"},{"$error":"#N/A"},{"$error":"#N/A"},{"$error":"#N/A"},{"$error":"#N/A"},{"$error":"#N/A"},{"$f":"ROUND(E34*D272/K272,0)","v":0},{"$f":"ROUND(E35*D272/K272,0)","v":0},null,"2011-07-12","2011-06-01",29,{"$f":"VLOOKUP(C272,BILL!D33:N54,11,TRUE)","v":0},null,null,null,null,null,null,null,null,null,null,null,null,null,null,null,null,null,null,null,null,null,null,null,null,null,null,null,null,null,null,null,null,null,null,null,"2012-03-01","2009-02-06"]
[null,30,{"$f":"CP193","v":"00:00:00"},0,"2011-07-30T00:14:24",{"$f":"VLOOKUP(C273,F71:G78,2,TRUE)","v":{"$error":"#N/A"}},{"$f":"VLOOKUP(C273,F81:G88,2,TRUE)","v":{"$error":"#N/A"}},{"$f":"VLOOKUP(C273,AM64:AO68,3,TRUE)","v":0},{"$f":"IF(C273<E136,IF(C273<AO71,AO69,AN69),IF(C273<AO71,AO70,AN70))","v":10},0,{"$f":"VLOOKUP(MONTH(C273),M125:N136,2,TRUE)","v":31},null,null,{"$error":"#N/A"},{"$error":"#N/A"},{"$error":"#N/A"},{"$error":"#N/A"},{"$error":"#N/A"},{"$error":"#N/A"},{"$f":"ROUND(E34*D273/K273,0)","v":0},{"$f":"ROUND(E35*D273/K273,0)","v":0},null,"2011-07-13","2011-06-01",30,{"$f":"VLOOKUP(C273,BILL!D34:N55,11,TRUE)","v":0},null,null,null,null,null,null,null,null,null,null,null,null,null,null,null,null,null,null,null,null,null,null,null,null,null,null,null,null,null,null,null,null,null,null,null,"2012-03-02","2009-02-07"]
[null,31,{"$f":"CQ194","v":"00:00:00"},0,"2011-07-30T00:14:24",{"$f":"VLOOKUP(C274,F71:G78,2,TRUE)","v":{"$error":"#N/A"}},{"$f":"VLOOKUP(C274,F81:G88,2,TRUE)","v":{"$error":"#N/A"}},{"$f":"VLOOKUP(C274,AM64:AO68,3,TRUE)","v":0},{"$f":"IF(C274<E136,IF(C274<AO71,AO69,AN69),IF(C274<AO71,AO70,AN70))","v":10},0,{"$f":"VLOOKUP(MONTH(C274),M125:N136,2,TRUE)","v":31},null,null,{"$error":"#N/A"},{"$error":"#N/A"},{"$error":"#N/A"},{"$error":"#N/A"},{"$error":"#N/A"},{"$error":"#N/A"},{"$f":"ROUND(E34*D274/K274,0)","v":0},{"$f":"ROUND(E35*D274/K274,0)","v":0},null,"2011-07-14","2011-06-01",31,{"$f":"VLOOKUP(C274,BILL!D35:N56,11,TRUE)","v":0},null,null,null,null,null,null,null,null,null,null,null,null,null,null,null,null,null,null,null,null,null,null,null,null,null,null,null,null,null,null,null,null,null,null,null,"2012-03-03","2009-02-08"]
[null,null,null,null,null,null,null,null,null,null,null,null,null,null,null,null,null,null,null,null,null,null,null,null,null,null,null,null,null,null,null,null,null,null,null,null,null,null,null,null,null,null,null,null,null,null,null,null,null,null,null,null,null,null,null,null,null,null,null,null,null,"2012-03-04","2009-02-09"]
[null,null,null,null,null,null,null,null,null,null,null,null,null,null,null,null,null,null,null,null,null,null,null,null,null,null,null,null,null,null,null,null,null,null,null,null,null,null,null,null,null,null,null,null,null,null,null,null,null,null,null,null,null,null,null,null,null,null,null,null,null,"2012-03-05","2009-02-10"]
[null,null,{"$f":"IF(C244<X244,C244,0)","v":"2010-02-01"},{"$f":"IF(C277=0,0,D244)","v":28},{"$f":"IF(C277=0,0,E244)","v":"2010-02-28"},{"$f":"IF(C277=0,0,F244)","v":14440},{"$f":"IF(C277=0,0,G244)","v":14860},{"$f":"IF(F277=0,0,H244)","v":16.263999999999999},{"$f":"IF(C277=0,0,I244)","v":10},{"$f":"IF(C277=0,0,J244)","v":10},{"$f":"IF(C277=0,0,K244)","v":28},{"$f":"IF(C277=0,0,L244)","v":0},{"$f":"IF(C277=0,0,M244)","v":0},{"$f":"IF(C277=0,0,N244)","v":14440},{"$f":"IF(C277=0,0,O244)","v":14860},{"$f":"IF(C277=0,0,P244)","v":2349},{"$f":"IF(C277=0,0,Q244)","v":1444},{"$f":"IF(C277=0,0,R244)","v":2417},{"$f":"IF(C277=0,0,S244)","v":1486},{"$f":"IF(C277=0,0,T244)","v":0},{"$f":"IF(D277=0,0,U244)","v":0},null,null,null,null,null,null,null,null,null,null,null,null,null,null,null,null,null,null,null,null,null,null,null,null,null,null,null,null,null,null,null,null,null,null,null,null,null,null,null,null,"2012-03-06","2009-02-11"]
[null,null,"2010-03-01",{"$f":"IF(C278=0,0,D245)","v":31},{"$f":"IF(C278=0,0,E245)","v":"2010-03-31"},{"$f":"IF(C278=0,0,F245)","v":14440},{"$f":"IF(C278=0,0,G245)","v":14860},{"$f":"IF(F278=0,0,H245)","v":16.263999999999999},10,10,31,0,0,14440,14860,2349,1444,2417,1486,{"$f":"IF(C278=0,0,T245)","v":0},{"$f":"IF(D278=0,0,U245)","v":0},null,null,null,null,null,null,null,null,null,null,null,null,1,null,null,null,null,null,null,null,null,null,null,null,null,null,null,null,null,null,null,null,null,null,null,null,null,null,null,null,"2012-03-07","2009-02-12"]
[null,null,"2010-04-01",30,"2010-04-30",14440,14860,16.263999999999999,10,10,30,0,0,14440,14860,2349,1444,2417,1486,0,0,null,null,null,null,null,null,null,null,null,null,null,null,2,null,null,null,null,null,null,null,null,null,null,null,null,null,null,null,null,null,null,null,null,null,null,null,null,null,null,null,"2012-03-08","2009-02-13"]
[null,null,"2010-05-01",31,"2010-05-31",14440,14860,16.263999999999999,10,10,31,0,0,14440,14860,2349,1444,2417,1486,0,0,null,null,null,null,null,null,null,null,null,null,null,null,3,null,null,null,null,null,null,null,null,null,null,null,null,null,null,null,null,null,null,null,null,null,null,null,null,null,null,null,"2012-03-09","2009-02-14"]
[null,null,"2010-06-01",30,"2010-06-30",14440,14860,16.263999999999999,10,10,30,0,0,14440,14860,2349,1444,2417,1486,0,0,null,null,null,null,null,null,null,null,null,null,null,null,4,null,null,null,null,null,null,null,null,null,null,null,null,null,null,null,null,null,null,null,null,null,null,null,null,null,null,null,"2012-03-10","2009-02-15"]
[null,null,"2010-07-01",31,"2010-07-31",14440,14860,24.824000000000002,10,10,31,0,0,14440,14860,3585,1444,3689,1486,0,0,null,null,null,null,null,null,null,null,null,null,null,null,5,null,null,null,null,null,null,null,null,null,null,null,null,null,null,null,null,null,null,null,null,null,null,null,null,null,null,null,"2012-03-11","2009-02-16"]
[null,null,"2010-08-01",31,"2010-08-31",14860,15280,24.824000000000002,10,10,31,0,0,14860,15280,3689,1486,3793,1528,0,0,null,null,null,null,null,null,null,null,null,null,null,null,6,null,null,null,null,null,null,null,null,null,null,null,null,null,null,null,null,null,null,null,null,null,null,null,null,null,null,null,"2012-03-12","2009-02-17"]
[null,null,"2010-09-01",30,"2010-09-30",14860,15280,24.824000000000002,10,10,30,0,0,14860,15280,3689,1486,3793,1528,0,0,null,null,null,null,null,null,null,null,null,null,null,null,7,null,null,null,null,null,null,null,null,null,null,null,null,null,null,null,null,null,null,null,null,null,null,null,null,null,null,null,"2012-03-13","2009-02-18"]
[null,null,"2010-10-01",31,"2010-10-31",14860,15280,24.824000000000002,10,10,31,0,0,14860,15280,3689,1486,3793,1528,0,0,null,null,null,null,null,null,null,null,null,null,null,null,8,null,null,null,null,null,null,null,null,null,null,null,null,null,null,null,null,null,null,null,null,null,null,null,null,null,null,null,"2012-03-14","2009-02-19"]
[null,null,"2010-11-01",30,"2010-11-30",14860,15280,24.824000000000002,10,10,30,0,0,14860,15280,3689,1486,3793,1528,0,0,null,null,null,null,null,null,null,null,null,null,null,null,9,null,null,null,null,null,null,null,null,null,null,null,null,null,null,null,null,null,null,null,null,null,null,null,null,null,null,null,"2012-03-15","2009-02-20"]
[null,null,"2010-12-01",31,"2010-12-31",14860,15280,24.824000000000002,10,10,31,0,0,14860,15280,3689,1486,3793,1528,0,0,null,null,null,null,null,null,null,null,null,null,null,null,10,null,null,null,null,null,null,null,null,null,null,null,null,null,null,null,null,null,null,null,null,null,null,null,null,null,null,null,"2012-03-16","2009-02-21"]
[null,null,"2011-01-01",31,"2011-01-31",14860,15280,29.96,10,10,31,0,0,14860,15280,4452,1486,4578,1528,0,0,null,null,null,null,null,null,null,null,null,null,null,null,11,null,null,null,null,null,null,null,null,null,null,null,null,null,null,null,null,null,null,null,null,null,null,null,null,null,null,null,"2012-03-17","2009-02-22"]
[null,null,"2011-02-01",28,"2011-02-28",14860,15280,29.96,10,10,28,0,0,14860,15280,4452,1486,4578,1528,0,0,null,null,null,null,null,null,null,null,null,null,null,null,12,null,null,null,null,null,null,null,null,null,null,null,null,null,null,null,null,null,null,null,null,null,null,null,null,null,null,null,"2012-03-18","2009-02-23"]
[null,null,"2011-03-01",31,"2011-03-31",14860,15280,29.96,10,10,31,0,0,14860,15280,4452,1486,4578,1528,0,0,null,null,null,null,null,null,null,null,null,null,null,null,13,null,null,null,null,null,null,null,null,null,null,null,null,null,null,null,null,null,null,null,null,null,null,null,null,null,null,null,"2012-03-19","2009-02-24"]
[null,null,"2011-04-01",30,"2011-04-30",14860,15280,29.96,12,12,30,0,0,14860,15280,4452,1783,4578,1834,0,0,null,null,null,null,null,null,null,null,null,null,null,null,14,null,null,null,null,null,null,null,null,null,null,null,null,null,null,null,null,null,null,null,null,null,null,null,null,null,null,null,"2012-03-20","2009-02-25"]
[null,null,"2011-05-01",31,"2011-05-31",14860,15280,29.96,12,12,31,0,0,14860,15280,4452,1783,4578,1834,0,0,null,null,null,null,null,null,null,null,null,null,null,null,15,null,null,null,null,null,null,null,null,null,null,null,null,null,null,null,null,null,null,null,null,null,null,null,null,null,null,null,"2012-03-21","2009-02-26"]
[null,null,"00:00:00",0,"00:00:00",0,0,0,0,0,0,0,0,0,0,0,0,0,0,0,0,null,null,null,null,null,null,null,null,null,null,null,null,16,null,null,null,null,null,null,null,null,null,null,null,null,null,null,null,null,null,null,null,null,null,null,null,null,null,null,null,"2012-03-22","2009-02-27"]
[null,null,"00:00:00",0,"00:00:00",0,0,0,0,0,0,0,0,0,0,0,0,0,0,0,0,null,null,null,null,null,null,null,null,null,null,null,null,17,null,null,null,null,null,null,null,null,null,null,null,null,null,null,null,null,null,null,null,null,null,null,null,null,null,null,null,"2012-03-23","2009-02-28"]
[null,null,"00:00:00",0,"00:00:00",0,0,0,0,0,0,0,0,0,0,0,0,0,0,0,0,null,null,null,null,null,null,null,null,null,null,null,null,18,null,null,null,null,null,null,null,null,null,null,null,null,null,null,null,null,null,null,null,null,null,null,null,null,null,null,null,"2012-03-24","2009-03-01"]
[null,null,"00:00:00",0,"00:00:00",0,0,0,0,0,0,0,0,0,0,0,0,0,0,0,0,null,null,null,null,null,null,null,null,null,null,null,null,19,null,null,null,null,null,null,null,null,null,null,null,null,null,null,null,null,null,null,null,null,null,null,null,null,null,null,null,"2012-03-25","2009-03-02"]
[null,null,"00:00:00",0,"00:00:00",0,0,0,0,0,0,0,0,0,0,0,0,0,0,0,0,null,null,null,null,null,null,null,null,null,null,null,null,20,null,null,null,null,null,null,null,null,null,null,null,null,null,null,null,null,null,null,null,null,null,null,null,null,null,null,null,"2012-03-26","2009-03-03"]
[null,null,null,null,null,null,null,null,null,null,null,null,null,null,null,null,null,null,null,null,null,null,null,null,null,null,null,null,null,null,null,null,null,21,null,null,null,null,null,null,null,null,null,null,null,null,null,null,null,null,null,null,null,null,null,null,null,null,null,null,null,"2012-03-27","2009-03-04"]
[null,null,null,null,null,null,null,null,null,null,null,null,null,null,null,null,null,null,null,null,null,null,null,null,null,null,null,null,null,null,null,null,null,22,null,null,null,null,null,null,null,null,null,null,null,null,null,null,null,null,null,null,null,null,null,null,null,null,null,null,null,"2012-03-28","2009-03-05"]
[null,{"$f":"VLOOKUP(X244,W244:Y274,3,TRUE)","v":17},{"$f":"VLOOKUP(B300,B243:Y274,2,TRUE)","v":"2011-06-01"},{"$f":"VLOOKUP(B300,B243:Y274,3,TRUE)","v":30},{"$f":"VLOOKUP(B300,B243:Y274,4,TRUE)","v":"2011-06-30"},{"$f":"VLOOKUP(B300,B243:Y274,5,TRUE)","v":14860},{"$f":"VLOOKUP(B300,B243:Y274,6,TRUE)","v":15280},{"$f":"VLOOKUP(B300,B243:Y274,7,TRUE)","v":29.96},{"$f":"VLOOKUP(B300,B243:Y274,8,TRUE)","v":12},{"$f":"VLOOKUP(B300,B243:Y274,9,TRUE)","v":12},{"$f":"VLOOKUP(B300,B243:Y274,10,TRUE)","v":30},{"$f":"VLOOKUP(B300,B243:Y274,11,TRUE)","v":0},{"$f":"VLOOKUP(B300,B243:Y274,12,TRUE)","v":0},{"$f":"VLOOKUP(B300,B243:Y274,13,TRUE)","v":14860},{"$f":"VLOOKUP(B300,B243:Y274,14,TRUE)","v":15280},{"$f":"VLOOKUP(B300,B243:Y274,15,TRUE)","v":4452},{"$f":"VLOOKUP(B300,B243:Y274,16,TRUE)","v":1783},{"$f":"VLOOKUP(B300,B243:Y274,17,TRUE)","v":4578},{"$f":"VLOOKUP(B300,B243:Y274,18,TRUE)","v":1834},{"$f":"VLOOKUP(B300,B243:Y274,19,TRUE)","v":0},{"$f":"IF(D300=0,0,U277)","v":0},null,null,null,null,null,null,null,null,null,null,null,null,23,null,null,null,null,null,null,null,null,null,null,null,null,null,null,null,null,null,null,null,null,null,null,null,null,null,null,null,"2012-03-29","2009-03-06"]
[null,{"$f":"B300+1","v":18},{"$f":"VLOOKUP(B301,B243:Y274,2,TRUE)","v":"2011-07-01"},{"$f":"VLOOKUP(B301,B243:Y274,3,TRUE)","v":30},{"$f":"VLOOKUP(B301,B243:Y274,4,TRUE)","v":"2011-07-30T00:14:24"},{"$f":"VLOOKUP(B301,B243:Y274,5,TRUE)","v":14860},{"$f":"VLOOKUP(B301,B243:Y274,6,TRUE)","v":15280},{"$f":"VLOOKUP(B301,B243:Y274,7,TRUE)","v":29.96},{"$f":"VLOOKUP(B301,B243:Y274,8,TRUE)","v":12},{"$f":"VLOOKUP(B301,B243:Y274,9,TRUE)","v":12},{"$f":"VLOOKUP(B301,B243:Y274,10,TRUE)","v":31},{"$f":"VLOOKUP(B301,B243:Y274,11,TRUE)","v":0},{"$f":"VLOOKUP(B301,B243:Y274,12,TRUE)","v":0},{"$f":"VLOOKUP(B301,B243:Y274,13,TRUE)","v":14381},{"$f":"VLOOKUP(B301,B243:Y274,14,TRUE)","v":14787},{"$f":"VLOOKUP(B301,B243:Y274,15,TRUE)","v":4309},{"$f":"VLOOKUP(B301,B243:Y274,16,TRUE)","v":1726},{"$f":"VLOOKUP(B301,B243:Y274,17,TRUE)","v":4430},{"$f":"VLOOKUP(B301,B243:Y274,18,TRUE)","v":1774},{"$f":"VLOOKUP(B301,B244:Y275,19,TRUE)","v":0},{"$f":"IF(D301=0,0,U278)","v":0},null,null,null,null,null,null,null,null,null,null,null,null,24,null,null,null,null,null,null,null,null,null,null,null,null,null,null,null,null,null,null,null,null,null,null,null,null,null,null,null,"2012-03-30","2009-03-07"]
[null,{"$f":"B301+1","v":19},{"$f":"VLOOKUP(B302,B243:Y274,2,TRUE)","v":"00:00:00"},{"$f":"VLOOKUP(B302,B243:Y274,3,TRUE)","v":0},{"$f":"VLOOKUP(B302,B243:Y274,4,TRUE)","v":"2011-07-30T00:14:24"},{"$f":"VLOOKUP(B302,B243:Y274,5,TRUE)","v":{"$error":"#N/A"}},{"$f":"VLOOKUP(B302,B243:Y274,6,TRUE)","v":{"$error":"#N/A"}},{"$f":"VLOOKUP(B302,B243:Y274,7,TRUE)","v":0},{"$f":"VLOOKUP(B302,B243:Y274,8,TRUE)","v":10},{"$f":"VLOOKUP(B302,B243:Y274,9,TRUE)","v":0},{"$f":"VLOOKUP(B302,B243:Y274,10,TRUE)","v":31},{"$f":"VLOOKUP(B302,B243:Y274,11,TRUE)","v":0},{"$f":"VLOOKUP(B302,B243:Y274,12,TRUE)","v":0},{"$f":"VLOOKUP(B302,B243:Y274,13,TRUE)","v":{"$error":"#N/A"}},{"$f":"VLOOKUP(B302,B243:Y274,14,TRUE)","v":{"$error":"#N/A"}},{"$f":"VLOOKUP(B302,B243:Y274,15,TRUE)","v":{"$error":"#N/A"}},{"$f":"VLOOKUP(B302,B243:Y274,16,TRUE)","v":{"$error":"#N/A"}},{"$f":"VLOOKUP(B302,B243:Y274,17,TRUE)","v":{"$error":"#N/A"}},{"$f":"VLOOKUP(B302,B243:Y274,18,TRUE)","v":{"$error":"#N/A"}},0,0,null,null,null,null,null,null,null,null,null,null,null,null,25,null,null,null,null,null,null,null,null,null,null,null,null,null,null,null,null,null,null,null,null,null,null,null,null,null,null,null,"2012-03-31","2009-03-08"]
[null,20,{"$f":"VLOOKUP(B303,B243:Y274,2,TRUE)","v":"00:00:00"},{"$f":"VLOOKUP(B303,B243:Y274,3,TRUE)","v":0},{"$f":"VLOOKUP(B303,B243:Y274,4,TRUE)","v":"2011-07-30T00:14:24"},{"$f":"VLOOKUP(B303,B243:Y274,5,TRUE)","v":{"$error":"#N/A"}},{"$f":"VLOOKUP(B303,B243:Y274,6,TRUE)","v":{"$error":"#N/A"}},{"$f":"VLOOKUP(B303,B243:Y274,7,TRUE)","v":0},{"$f":"VLOOKUP(B303,B243:Y274,8,TRUE)","v":10},{"$f":"VLOOKUP(B303,B243:Y274,9,TRUE)","v":0},{"$f":"VLOOKUP(B303,B243:Y274,10,TRUE)","v":31},{"$f":"VLOOKUP(B303,B243:Y274,11,TRUE)","v":0},{"$f":"VLOOKUP(B303,B243:Y274,12,TRUE)","v":0},{"$f":"VLOOKUP(B303,B243:Y274,13,TRUE)","v":{"$error":"#N/A"}},{"$f":"VLOOKUP(B303,B243:Y274,14,TRUE)","v":{"$error":"#N/A"}},{"$f":"VLOOKUP(B303,B243:Y274,15,TRUE)","v":{"$error":"#N/A"}},{"$f":"VLOOKUP(B303,B243:Y274,16,TRUE)","v":{"$error":"#N/A"}},{"$f":"VLOOKUP(B303,B243:Y274,17,TRUE)","v":{"$error":"#N/A"}},{"$f":"VLOOKUP(B303,B243:Y274,18,TRUE)","v":{"$error":"#N/A"}},0,0,null,null,null,null,null,null,null,null,null,null,null,null,26,null,null,null,null,null,null,null,null,null,null,null,null,null,null,null,null,null,null,null,null,null,null,null,null,null,null,null,"2012-04-01","2009-03-09"]
[null,21,{"$f":"VLOOKUP(B304,B243:Y274,2,TRUE)","v":"00:00:00"},{"$f":"VLOOKUP(B304,B243:Y274,3,TRUE)","v":0},{"$f":"VLOOKUP(B304,B243:Y274,4,TRUE)","v":"2011-07-30T00:14:24"},{"$f":"VLOOKUP(B304,B243:Y274,5,TRUE)","v":{"$error":"#N/A"}},{"$f":"VLOOKUP(B304,B243:Y274,6,TRUE)","v":{"$error":"#N/A"}},{"$f":"VLOOKUP(B304,B243:Y274,7,TRUE)","v":0},{"$f":"VLOOKUP(B304,B243:Y274,8,TRUE)","v":10},{"$f":"VLOOKUP(B304,B243:Y274,9,TRUE)","v":0},{"$f":"VLOOKUP(B304,B243:Y274,10,TRUE)","v":31},{"$f":"VLOOKUP(B304,B243:Y274,11,TRUE)","v":0},{"$f":"VLOOKUP(B304,B243:Y274,12,TRUE)","v":0},{"$f":"VLOOKUP(B304,B243:Y274,13,TRUE)","v":{"$error":"#N/A"}},{"$f":"VLOOKUP(B304,B243:Y274,14,TRUE)","v":{"$error":"#N/A"}},{"$f":"VLOOKUP(B304,B243:Y274,15,TRUE)","v":{"$error":"#N/A"}},{"$f":"VLOOKUP(B304,B243:Y274,16,TRUE)","v":{"$error":"#N/A"}},{"$f":"VLOOKUP(B304,B243:Y274,17,TRUE)","v":{"$error":"#N/A"}},{"$f":"VLOOKUP(B304,B243:Y274,18,TRUE)","v":{"$error":"#N/A"}},0,0,null,null,null,null,null,null,null,null,null,null,null,null,27,null,null,null,null,null,null,null,null,null,null,null,null,null,null,null,null,null,null,null,null,null,null,null,null,null,null,null,"2012-04-02","2009-03-10"]
[null,22,{"$f":"VLOOKUP(B305,B243:Y274,2,TRUE)","v":"00:00:00"},{"$f":"VLOOKUP(B305,B243:Y274,3,TRUE)","v":0},{"$f":"VLOOKUP(B305,B243:Y274,4,TRUE)","v":"2011-07-30T00:14:24"},{"$f":"VLOOKUP(B305,B243:Y274,5,TRUE)","v":{"$error":"#N/A"}},{"$f":"VLOOKUP(B305,B243:Y274,6,TRUE)","v":{"$error":"#N/A"}},{"$f":"VLOOKUP(B305,B243:Y274,7,TRUE)","v":0},{"$f":"VLOOKUP(B305,B243:Y274,8,TRUE)","v":10},{"$f":"VLOOKUP(B305,B243:Y274,9,TRUE)","v":0},{"$f":"VLOOKUP(B305,B243:Y274,10,TRUE)","v":31},{"$f":"VLOOKUP(B305,B243:Y274,11,TRUE)","v":0},{"$f":"VLOOKUP(B305,B243:Y274,12,TRUE)","v":0},{"$f":"VLOOKUP(B305,B243:Y274,13,TRUE)","v":{"$error":"#N/A"}},{"$f":"VLOOKUP(B305,B243:Y274,14,TRUE)","v":{"$error":"#N/A"}},{"$f":"VLOOKUP(B305,B243:Y274,15,TRUE)","v":{"$error":"#N/A"}},{"$f":"VLOOKUP(B305,B243:Y274,16,TRUE)","v":{"$error":"#N/A"}},{"$f":"VLOOKUP(B305,B243:Y274,17,TRUE)","v":{"$error":"#N/A"}},{"$f":"VLOOKUP(B305,B243:Y274,18,TRUE)","v":{"$error":"#N/A"}},0,0,null,null,null,null,null,null,null,null,null,null,null,null,28,null,null,null,null,null,null,null,null,null,null,null,null,null,null,null,null,null,null,null,null,null,null,null,null,null,null,null,"2012-04-03","2009-03-11"]
[null,23,{"$f":"VLOOKUP(B306,B243:Y274,2,TRUE)","v":"00:00:00"},{"$f":"VLOOKUP(B306,B243:Y274,3,TRUE)","v":0},{"$f":"VLOOKUP(B306,B243:Y274,4,TRUE)","v":"2011-07-30T00:14:24"},{"$f":"VLOOKUP(B306,B243:Y274,5,TRUE)","v":{"$error":"#N/A"}},{"$f":"VLOOKUP(B306,B243:Y274,6,TRUE)","v":{"$error":"#N/A"}},{"$f":"VLOOKUP(B306,B243:Y274,7,TRUE)","v":0},{"$f":"VLOOKUP(B306,B243:Y274,8,TRUE)","v":10},{"$f":"VLOOKUP(B306,B243:Y274,9,TRUE)","v":0},{"$f":"VLOOKUP(B306,B243:Y274,10,TRUE)","v":31},{"$f":"VLOOKUP(B306,B243:Y274,11,TRUE)","v":0},{"$f":"VLOOKUP(B306,B243:Y274,12,TRUE)","v":0},{"$f":"VLOOKUP(B306,B243:Y274,13,TRUE)","v":{"$error":"#N/A"}},{"$f":"VLOOKUP(B306,B243:Y274,14,TRUE)","v":{"$error":"#N/A"}},{"$f":"VLOOKUP(B306,B243:Y274,15,TRUE)","v":{"$error":"#N/A"}},{"$f":"VLOOKUP(B306,B243:Y274,16,TRUE)","v":{"$error":"#N/A"}},{"$f":"VLOOKUP(B306,B243:Y274,17,TRUE)","v":{"$error":"#N/A"}},{"$f":"VLOOKUP(B306,B243:Y274,18,TRUE)","v":{"$error":"#N/A"}},0,0,null,null,null,null,null,null,null,null,null,null,null,null,29,null,null,null,null,null,null,null,null,null,null,null,null,null,null,null,null,null,null,null,null,null,null,null,null,null,null,null,"2012-04-04","2009-03-12"]
[null,24,{"$f":"VLOOKUP(B307,B243:Y274,2,TRUE)","v":"00:00:00"},{"$f":"VLOOKUP(B307,B243:Y274,3,TRUE)","v":0},{"$f":"VLOOKUP(B307,B243:Y274,4,TRUE)","v":"2011-07-30T00:14:24"},{"$f":"VLOOKUP(B307,B243:Y274,5,TRUE)","v":{"$error":"#N/A"}},{"$f":"VLOOKUP(B307,B243:Y274,6,TRUE)","v":{"$error":"#N/A"}},{"$f":"VLOOKUP(B307,B243:Y274,7,TRUE)","v":0},{"$f":"VLOOKUP(B307,B243:Y274,8,TRUE)","v":10},{"$f":"VLOOKUP(B307,B243:Y274,9,TRUE)","v":0},{"$f":"VLOOKUP(B307,B243:Y274,10,TRUE)","v":31},{"$f":"VLOOKUP(B307,B243:Y274,11,TRUE)","v":0},{"$f":"VLOOKUP(B307,B243:Y274,12,TRUE)","v":0},{"$f":"VLOOKUP(B307,B243:Y274,13,TRUE)","v":{"$error":"#N/A"}},{"$f":"VLOOKUP(B307,B243:Y274,14,TRUE)","v":{"$error":"#N/A"}},{"$f":"VLOOKUP(B307,B243:Y274,15,TRUE)","v":{"$error":"#N/A"}},{"$f":"VLOOKUP(B307,B243:Y274,16,TRUE)","v":{"$error":"#N/A"}},{"$f":"VLOOKUP(B307,B243:Y274,17,TRUE)","v":{"$error":"#N/A"}},{"$f":"VLOOKUP(B307,B243:Y274,18,TRUE)","v":{"$error":"#N/A"}},0,0,null,null,null,null,null,null,null,null,null,null,null,null,30,null,null,null,null,null,null,null,null,null,null,null,null,null,null,null,null,null,null,null,null,null,null,null,null,null,null,null,"2012-04-05","2009-03-13"]
[null,25,{"$f":"VLOOKUP(B308,B243:Y274,2,TRUE)","v":"00:00:00"},{"$f":"VLOOKUP(B308,B243:Y274,3,TRUE)","v":0},{"$f":"VLOOKUP(B308,B243:Y274,4,TRUE)","v":"2011-07-30T00:14:24"},{"$f":"VLOOKUP(B308,B243:Y274,5,TRUE)","v":{"$error":"#N/A"}},{"$f":"VLOOKUP(B308,B243:Y274,6,TRUE)","v":{"$error":"#N/A"}},{"$f":"VLOOKUP(B308,B243:Y274,7,TRUE)","v":0},{"$f":"VLOOKUP(B308,B243:Y274,8,TRUE)","v":10},{"$f":"VLOOKUP(B308,B243:Y274,9,TRUE)","v":0},{"$f":"VLOOKUP(B308,B243:Y274,10,TRUE)","v":31},{"$f":"VLOOKUP(B308,B243:Y274,11,TRUE)","v":0},{"$f":"VLOOKUP(B308,B243:Y274,12,TRUE)","v":0},{"$f":"VLOOKUP(B308,B243:Y274,13,TRUE)","v":{"$error":"#N/A"}},{"$f":"VLOOKUP(B308,B243:Y274,14,TRUE)","v":{"$error":"#N/A"}},{"$f":"VLOOKUP(B308,B243:Y274,15,TRUE)","v":{"$error":"#N/A"}},{"$f":"VLOOKUP(B308,B243:Y274,16,TRUE)","v":{"$error":"#N/A"}},{"$f":"VLOOKUP(B308,B243:Y274,17,TRUE)","v":{"$error":"#N/A"}},{"$f":"VLOOKUP(B308,B243:Y274,18,TRUE)","v":{"$error":"#N/A"}},0,0,null,null,null,null,null,null,null,null,null,null,null,null,31,null,null,null,null,null,null,null,null,null,null,null,null,null,null,null,null,null,null,null,null,null,null,null,null,null,null,null,"2012-04-06","2009-03-14"]
[null,26,{"$f":"VLOOKUP(B309,B243:Y274,2,TRUE)","v":"00:00:00"},{"$f":"VLOOKUP(B309,B243:Y274,3,TRUE)","v":0},{"$f":"VLOOKUP(B309,B243:Y274,4,TRUE)","v":"2011-07-30T00:14:24"},{"$f":"VLOOKUP(B309,B243:Y274,5,TRUE)","v":{"$error":"#N/A"}},{"$f":"VLOOKUP(B309,B243:Y274,6,TRUE)","v":{"$error":"#N/A"}},{"$f":"VLOOKUP(B309,B243:Y274,7,TRUE)","v":0},{"$f":"VLOOKUP(B309,B243:Y274,8,TRUE)","v":10},{"$f":"VLOOKUP(B309,B243:Y274,9,TRUE)","v":0},{"$f":"VLOOKUP(B309,B243:Y274,10,TRUE)","v":31},{"$f":"VLOOKUP(B309,B243:Y274,11,TRUE)","v":0},{"$f":"VLOOKUP(B309,B243:Y274,12,TRUE)","v":0},{"$f":"VLOOKUP(B309,B243:Y274,13,TRUE)","v":{"$error":"#N/A"}},{"$f":"VLOOKUP(B309,B243:Y274,14,TRUE)","v":{"$error":"#N/A"}},{"$f":"VLOOKUP(B309,B243:Y274,15,TRUE)","v":{"$error":"#N/A"}},{"$f":"VLOOKUP(B309,B243:Y274,16,TRUE)","v":{"$error":"#N/A"}},{"$f":"VLOOKUP(B309,B243:Y274,17,TRUE)","v":{"$error":"#N/A"}},{"$f":"VLOOKUP(B309,B243:Y274,18,TRUE)","v":{"$error":"#N/A"}},0,0,null,null,null,null,null,null,null,null,null,null,null,null,32,null,null,null,null,null,null,null,null,null,null,null,null,null,null,null,null,null,null,null,null,null,null,null,null,null,null,null,"2012-04-07","2009-03-15"]
[null,27,{"$f":"VLOOKUP(B310,B243:Y274,2,TRUE)","v":"00:00:00"},{"$f":"VLOOKUP(B310,B243:Y274,3,TRUE)","v":0},{"$f":"VLOOKUP(B310,B243:Y274,4,TRUE)","v":"2011-07-30T00:14:24"},{"$f":"VLOOKUP(B310,B243:Y274,5,TRUE)","v":{"$error":"#N/A"}},{"$f":"VLOOKUP(B310,B243:Y274,6,TRUE)","v":{"$error":"#N/A"}},{"$f":"VLOOKUP(B310,B243:Y274,7,TRUE)","v":0},{"$f":"VLOOKUP(B310,B243:Y274,8,TRUE)","v":10},{"$f":"VLOOKUP(B310,B243:Y274,9,TRUE)","v":0},{"$f":"VLOOKUP(B310,B243:Y274,10,TRUE)","v":31},{"$f":"VLOOKUP(B310,Y243:BB274,11,TRUE)","v":0},{"$f":"VLOOKUP(B310,B243:Y274,12,TRUE)","v":0},{"$f":"VLOOKUP(B310,B243:Y274,13,TRUE)","v":{"$error":"#N/A"}},{"$f":"VLOOKUP(B310,B243:Y274,14,TRUE)","v":{"$error":"#N/A"}},{"$f":"VLOOKUP(B310,B243:Y274,15,TRUE)","v":{"$error":"#N/A"}},{"$f":"VLOOKUP(B310,B243:Y274,16,TRUE)","v":{"$error":"#N/A"}},{"$f":"VLOOKUP(B310,B243:Y274,17,TRUE)","v":{"$error":"#N/A"}},{"$f":"VLOOKUP(B310,B243:Y274,18,TRUE)","v":{"$error":"#N/A"}},0,0,null,null,null,null,null,null,null,null,null,null,null,null,33,null,null,null,null,null,null,null,null,null,null,null,null,null,null,null,null,null,null,null,null,null,null,null,null,null,null,null,"2012-04-08","2009-03-16"]
[null,null,null,null,null,null,null,null,null,null,null,null,null,null,null,null,null,null,null,null,null,null,null,null,null,null,null,null,null,null,null,null,null,34,null,null,null,null,null,null,null,null,null,null,null,null,null,null,null,null,null,null,null,null,null,null,null,null,null,null,null,"2012-04-09","2009-03-17"]
[null,{"$f":"B300","v":17},{"$f":"C300","v":"2011-06-01"},{"$f":"D300","v":30},{"$f":"IF(C300=0,0,E300)","v":"2011-06-30"},{"$f":"IF(C300=0,0,F300)","v":14860},{"$f":"IF(C300=0,0,G300)","v":15280},{"$f":"IF(C300=0,0,H300)","v":29.96},{"$f":"IF(C300=0,0,I300)","v":12},{"$f":"IF(C300=0,0,J300)","v":12},{"$f":"IF(C300=0,0,K300)","v":30},{"$f":"IF(C300=0,0,L300)","v":0},{"$f":"IF(C300=0,0,M300)","v":0},{"$f":"IF(C300=0,0,N300)","v":14860},{"$f":"IF(C300=0,0,O300)","v":15280},{"$f":"IF(C300=0,0,P300)","v":4452},{"$f":"IF(C300=0,0,Q300)","v":1783},{"$f":"IF(C300=0,0,R300)","v":4578},{"$f":"IF(C300=0,0,S300)","v":1834},{"$f":"IF(C312=0,0,T300)","v":0},{"$f":"IF(D312=0,0,U300)","v":0},null,null,null,null,null,null,null,null,null,null,null,null,35,null,null,null,null,null,null,null,null,null,null,null,null,null,null,null,null,null,null,null,null,null,null,null,null,null,null,null,"2012-04-10","2009-03-18"]
[null,{"$f":"B301","v":18},"2011-07-01",30,{"$f":"IF(C301=0,0,E301)","v":"2011-07-30T00:14:24"},{"$f":"IF(C301=0,0,F301)","v":14860},{"$f":"IF(C301=0,0,G301)","v":15280},{"$f":"IF(C301=0,0,H301)","v":29.96},{"$f":"IF(C301=0,0,I301)","v":12},{"$f":"IF(C301=0,0,J301)","v":12},{"$f":"IF(C301=0,0,K301)","v":31},{"$f":"IF(C301=0,0,L301)","v":0},{"$f":"IF(C301=0,0,M301)","v":0},{"$f":"IF(C301=0,0,N301)","v":14381},{"$f":"IF(C301=0,0,O301)","v":14787},{"$f":"IF(C301=0,0,P301)","v":4309},{"$f":"IF(C301=0,0,Q301)","v":1726},{"$f":"IF(C301=0,0,R301)","v":4430},{"$f":"IF(C301=0,0,S301)","v":1774},0,0,null,null,null,null,null,null,null,null,null,null,null,null,36,null,null,null,null,null,null,null,null,null,null,null,null,null,null,null,null,null,null,null,null,null,null,null,null,null,null,null,"2012-04-11","2009-03-19"]
[null,19,"00:00:00",0,"00:00:00",0,0,0,0,0,0,0,0,0,0,0,0,0,0,0,0,null,null,null,null,null,null,null,null,null,null,null,null,37,null,null,null,null,null,null,null,null,null,null,null,null,null,null,null,null,null,null,null,null,null,null,null,null,null,null,null,"2012-04-12","2009-03-20"]
[null,20,"00:00:00",0,"00:00:00",0,0,0,0,0,0,0,0,0,0,0,0,0,0,0,0,null,null,null,null,null,null,null,null,null,null,null,null,38,null,null,null,null,null,null,null,null,null,null,null,null,null,null,null,null,null,null,null,null,null,null,null,null,null,null,null,"2012-04-13","2009-03-21"]
[null,21,"00:00:00",0,"00:00:00",0,0,0,0,0,0,0,0,0,0,0,0,0,0,0,0,null,null,null,null,null,null,null,null,null,null,null,null,39,null,null,null,null,null,null,null,null,null,null,null,null,null,null,null,null,null,null,null,null,null,null,null,null,null,null,null,"2012-04-14","2009-03-22"]
[null,22,"00:00:00",0,"00:00:00",0,0,0,0,0,0,0,0,0,0,0,0,0,0,0,0,null,null,null,null,null,null,null,null,null,null,null,null,40,null,null,null,null,null,null,null,null,null,null,null,null,null,null,null,null,null,null,null,null,null,null,null,null,null,null,null,"2012-04-15","2009-03-23"]
[null,23,"00:00:00",0,"00:00:00",0,0,0,0,0,0,0,0,0,0,0,0,0,0,0,0,null,null,null,null,null,null,null,null,null,null,null,null,41,null,null,null,null,null,null,null,null,null,null,null,null,null,null,null,null,null,null,null,null,null,null,null,null,null,null,null,"2012-04-16","2009-03-24"]
[null,24,"00:00:00",0,"00:00:00",0,0,0,0,0,0,0,0,0,0,0,0,0,0,0,0,null,null,null,null,null,null,null,null,null,null,null,null,42,null,null,null,null,null,null,null,null,null,null,null,null,null,null,null,null,null,null,null,null,null,null,null,null,null,null,null,"2012-04-17","2009-03-25"]
[null,25,"00:00:00",0,"00:00:00",0,0,0,0,0,0,0,0,0,0,0,0,0,0,0,0,null,null,null,null,null,null,null,null,null,null,null,null,43,null,null,null,null,null,null,null,null,null,null,null,null,null,null,null,null,null,null,null,null,null,null,null,null,null,null,null,"2012-04-18","2009-03-26"]
[null,26,"00:00:00",0,"00:00:00",0,0,0,0,0,0,0,0,0,0,0,0,0,0,0,0,null,null,null,null,null,null,null,null,null,null,null,null,44,null,null,null,null,null,null,null,null,null,null,null,null,null,null,null,null,null,null,null,null,null,null,null,null,null,null,null,"2012-04-19","2009-03-27"]
[null,27,"00:00:00",0,"00:00:00",0,0,0,0,0,0,0,0,0,0,0,0,0,0,0,0,null,null,null,null,null,null,null,null,null,null,null,null,45,null,null,null,null,null,null,null,null,null,null,null,null,null,null,null,null,null,null,null,null,null,null,null,null,null,null,null,"2012-04-20","2009-03-28"]
[null,null,null,null,null,null,null,null,null,null,null,null,null,null,null,null,null,null,null,null,null,null,null,null,null,null,null,null,null,null,null,null,null,null,null,null,null,null,null,null,null,null,null,null,null,null,null,null,null,null,null,null,null,null,null,null,null,null,null,null,null,"2012-04-21","2009-03-29"]
[null,null,null,null,null,null,null,null,null,null,null,null,null,null,null,null,null,null,null,null,null,null,null,null,null,null,null,null,null,null,null,null,null,null,null,null,null,null,null,null,null,null,null,null,null,null,null,null,null,null,null,null,null,null,null,null,null,null,null,null,null,"2012-04-22","2009-03-30"]
[null,null,null,null,null,null,null,null,null,null,null,null,null,null,null,null,null,null,null,null,null,null,null,null,null,null,null,null,null,null,null,null,null,null,null,null,null,null,null,null,null,null,null,null,null,null,null,null,null,null,null,null,null,null,null,null,null,null,null,null,null,"2012-04-23","2009-03-31"]
[null,null,null,null,null,null,null,null,null,null,null,null,null,null,null,null,null,null,null,null,null,null,null,null,null,null,null,null,null,null,null,null,null,null,null,null,null,null,null,null,null,null,null,null,null,null,null,null,null,null,null,null,null,null,null,null,null,null,null,null,null,"2012-04-24","2009-04-01"]
[null,null,null,null,null,null,null,null,null,null,null,null,null,null,null,null,null,null,null,null,null,null,null,null,null,null,null,null,null,null,null,null,null,null,null,null,null,null,null,null,null,null,null,null,null,null,null,null,null,null,null,null,null,null,null,null,null,null,null,null,null,"2012-04-25","2009-04-02"]
[null,null,null,null,null,null,null,null,null,null,null,null,null,null,null,null,null,null,null,null,null,null,null,null,null,null,null,null,null,null,null,null,null,null,null,null,null,null,null,null,null,null,null,null,null,null,null,null,null,null,null,null,null,null,null,null,null,null,null,null,null,"2012-04-26","2009-04-03"]
[null,null,null,null,null,null,null,null,null,null,null,null,null,null,null,null,null,null,null,null,null,null,null,null,null,null,null,null,null,null,null,null,null,null,null,null,null,null,null,null,null,null,null,null,null,null,null,null,null,null,null,null,null,null,null,null,null,null,null,null,null,"2012-04-27","2009-04-04"]
[null,null,null,null,null,null,null,null,null,null,null,null,null,null,null,null,null,null,null,null,null,null,null,null,null,null,null,null,null,null,null,null,null,null,null,null,null,null,null,null,null,null,null,null,null,null,null,null,null,null,null,null,null,null,null,null,null,null,null,null,null,"2012-04-28","2009-04-05"]
[null,null,null,null,null,null,null,null,null,null,null,null,null,null,null,null,null,null,null,null,null,null,null,null,null,null,null,null,null,null,null,null,null,null,null,null,null,null,null,null,null,null,null,null,null,null,null,null,null,null,null,null,null,null,null,null,null,null,null,null,null,"2012-04-29","2009-04-06"]
[null,null,null,null,null,null,null,null,null,null,null,null,null,null,null,null,null,null,null,null,null,null,null,null,null,null,null,null,null,null,null,null,null,null,null,null,null,null,null,null,null,null,null,null,null,null,null,null,null,null,null,null,null,null,null,null,null,null,null,null,null,"2012-04-30","2009-04-07"]
[null,null,null,null,null,null,null,null,null,null,null,null,null,null,null,null,null,null,null,null,null,null,null,null,null,null,null,null,null,null,null,null,null,null,null,null,null,null,null,null,null,null,null,null,null,null,null,null,null,null,null,null,null,null,null,null,null,null,null,null,null,"2012-05-01","2009-04-08"]
[null,null,null,null,null,null,null,null,null,null,null,null,null,null,null,null,null,null,null,null,null,null,null,null,null,null,null,null,null,null,null,null,null,null,null,null,null,null,null,null,null,null,null,null,null,null,null,null,null,null,null,null,null,null,null,null,null,null,null,null,null,null,"2009-04-09"]
[null,null,null,null,null,null,null,null,null,null,null,null,null,null,null,null,null,null,null,null,null,null,null,null,null,null,null,null,null,null,null,null,null,null,null,null,null,null,null,null,null,null,null,null,null,null,null,null,null,null,null,null,null,null,null,null,null,null,null,null,null,null,"2009-04-10"]
[null,null,null,null,null,null,null,null,null,null,null,null,null,null,null,null,null,null,null,null,null,null,null,null,null,null,null,null,null,null,null,null,null,null,null,null,null,null,null,null,null,null,null,null,null,null,null,null,null,null,null,null,null,null,null,null,null,null,null,null,null,null,"2009-04-11"]
[null,null,null,null,null,null,null,null,null,null,null,null,null,null,null,null,null,null,null,null,null,null,null,null,{"$f":"SUM(BILL!#REF!)","v":{"$error":"#REF!"}},null,null,null,null,null,null,null,null,null,null,null,null,null,null,null,null,null,null,null,null,null,null,null,null,null,null,null,null,null,null,null,null,null,null,null,null,null,"2009-04-12"]
[null,null,null,null,null,null,null,null,null,null,null,null,null,null,null,null,null,null,null,null,null,null,null,null,null,null,null,null,null,null,null,null,null,null,null,null,null,null,null,null,null,null,null,null,null,null,null,null,null,null,null,null,null,null,null,null,null,null,null,null,null,null,"2009-04-13"]
[null,null,null,null,null,null,null,null,null,null,null,null,null,null,null,null,null,null,null,null,null,null,null,null,null,null,null,null,null,null,null,null,null,null,null,null,null,null,null,null,null,null,null,null,null,null,null,null,null,null,null,null,null,null,null,null,null,null,null,null,null,null,"2009-04-14"]
[null,null,null,null,null,null,null,null,null,null,null,null,null,null,null,null,null,null,null,null,null,null,null,null,null,null,null,null,null,null,null,null,null,null,null,null,null,null,null,null,null,null,null,null,null,null,null,null,null,null,null,null,null,null,null,null,null,null,null,null,null,null,"2009-04-15"]
[null,null,null,null,null,null,null,null,null,null,null,null,null,null,null,null,null,null,null,null,null,null,null,null,null,null,null,null,null,null,null,null,null,null,null,null,null,null,null,null,null,null,null,null,null,null,null,null,null,null,null,null,null,null,null,null,null,null,null,null,null,null,"2009-04-16"]
[null,null,null,null,null,null,null,null,null,null,null,null,null,null,null,null,null,null,null,null,null,null,null,null,null,null,null,null,null,null,null,null,null,null,null,null,null,null,null,null,null,null,null,null,null,null,null,null,null,null,null,null,null,null,null,null,null,null,null,null,null,null,"2009-04-17"]
[null,null,null,null,null,null,null,null,null,null,null,null,null,null,null,null,null,null,null,null,null,null,null,null,null,null,null,null,null,null,null,null,null,null,null,null,null,null,null,null,null,null,null,null,null,null,null,null,null,null,null,null,null,null,null,null,null,null,null,null,null,null,"2009-04-18"]
[null,null,null,null,null,null,null,null,null,null,null,null,null,null,null,null,null,null,null,null,null,null,null,null,null,null,null,null,null,null,null,null,null,null,null,null,null,null,null,null,null,null,null,null,null,null,null,null,null,null,null,null,null,null,null,null,null,null,null,null,null,null,"2009-04-19"]
[null,null,null,null,null,null,null,null,null,null,null,null,null,null,null,null,null,null,null,null,null,null,null,null,null,null,null,null,null,null,null,null,null,null,null,null,null,null,null,null,null,null,null,null,null,null,null,null,null,null,null,null,null,null,null,null,null,null,null,null,null,null,"2009-04-20"]
[null,null,null,null,null,null,null,null,null,null,null,null,null,null,null,null,null,null,null,null,null,null,null,null,null,null,null,null,null,null,null,null,null,null,null,null,null,null,null,null,null,null,null,null,null,null,null,null,null,null,null,null,null,null,null,null,null,null,null,null,null,null,"2009-04-21"]
[null,null,null,null,null,null,null,null,null,null,null,null,null,null,null,null,null,null,null,null,null,null,null,null,null,null,null,null,null,null,null,null,null,null,null,null,null,null,null,null,null,null,null,null,null,null,null,null,null,null,null,null,null,null,null,null,null,null,null,null,null,null,"2009-04-22"]
[null,null,null,null,null,null,null,null,null,null,null,null,null,null,null,null,null,null,null,null,null,null,null,null,null,null,null,null,null,null,null,null,null,null,null,null,null,null,null,null,null,null,null,null,null,null,null,null,null,null,null,null,null,null,null,null,null,null,null,null,null,null,"2009-04-23"]
[null,null,null,null,null,null,null,null,null,null,null,null,null,null,null,null,null,null,null,null,null,null,null,null,null,null,null,null,null,null,null,null,null,null,null,null,null,null,null,null,null,null,null,null,null,null,null,null,null,null,null,null,null,null,null,null,null,null,null,null,null,null,"2009-04-24"]
[null,null,null,null,null,null,null,null,null,null,null,null,null,null,null,null,null,null,null,null,null,null,null,null,null,null,null,null,null,null,null,null,null,null,null,null,null,null,null,null,null,null,null,null,null,null,null,null,null,null,null,null,null,null,null,null,null,null,null,null,null,null,"2009-04-25"]
[null,null,null,null,null,null,null,null,null,null,null,null,null,null,null,null,null,null,null,null,null,null,null,null,null,null,null,null,null,null,null,null,null,null,null,null,null,null,null,null,null,null,null,null,null,null,null,null,null,null,null,null,null,null,null,null,null,null,null,null,null,null,"2009-04-26"]
[null,null,null,null,null,null,null,null,null,null,null,null,null,null,null,null,null,null,null,null,null,null,null,null,null,null,null,null,null,null,null,null,null,null,null,null,null,null,null,null,null,null,null,null,null,null,null,null,null,null,null,null,null,null,null,null,null,null,null,null,null,null,"2009-04-27"]
[null,null,null,null,null,null,null,null,null,null,null,null,null,null,null,null,null,null,null,null,null,null,null,null,null,null,null,null,null,null,null,null,null,null,null,null,null,null,null,null,null,null,null,null,null,null,null,null,null,null,null,null,null,null,null,null,null,null,null,null,null,null,"2009-04-28"]
[null,null,null,null,null,null,null,null,null,null,null,null,null,null,null,null,null,null,null,null,null,null,null,null,null,null,null,null,null,null,null,null,null,null,null,null,null,null,null,null,null,null,null,null,null,null,null,null,null,null,null,null,null,null,null,null,null,null,null,null,null,null,"2009-04-29"]
[null,null,null,null,null,null,null,null,null,null,null,null,null,null,null,null,null,null,null,null,null,null,null,null,null,null,null,null,null,null,null,null,null,null,null,null,null,null,null,null,null,null,null,null,null,null,null,null,null,null,null,null,null,null,null,null,null,null,null,null,null,null,"2009-04-30"]
[null,null,null,null,null,null,null,null,null,null,null,null,null,null,null,null,null,null,null,null,null,null,null,null,null,null,null,null,null,null,null,null,null,null,null,null,null,null,null,null,null,null,null,null,null,null,null,null,null,null,null,null,null,null,null,null,null,null,null,null,null,null,"2009-05-01"]
[null,null,null,null,null,null,null,null,null,null,null,null,null,null,null,null,null,null,null,null,null,null,null,null,null,null,null,null,null,null,null,null,null,null,null,null,null,null,null,null,null,null,null,null,null,null,null,null,null,null,null,null,null,null,null,null,null,null,null,null,null,null,"2009-05-02"]
[null,null,null,null,null,null,null,null,null,null,null,null,null,null,null,null,null,null,null,null,null,null,null,null,null,null,null,null,null,null,null,null,null,null,null,null,null,null,null,null,null,null,null,null,null,null,null,null,null,null,null,null,null,null,null,null,null,null,null,null,null,null,"2009-05-03"]
[null,null,null,null,null,null,null,null,null,null,null,null,null,null,null,null,null,null,null,null,null,null,null,null,null,null,null,null,null,null,null,null,null,null,null,null,null,null,null,null,null,null,null,null,null,null,null,null,null,null,null,null,null,null,null,null,null,null,null,null,null,null,"2009-05-04"]
[null,null,null,null,null,null,null,null,null,null,null,null,null,null,null,null,null,null,null,null,null,null,null,null,null,null,null,null,null,null,null,null,null,null,null,null,null,null,null,null,null,null,null,null,null,null,null,null,null,null,null,null,null,null,null,null,null,null,null,null,null,null,"2009-05-05"]
[null,null,null,null,null,null,null,null,null,null,null,null,null,null,null,null,null,null,null,null,null,null,null,null,null,null,null,null,null,null,null,null,null,null,null,null,null,null,null,null,null,null,null,null,null,null,null,null,null,null,null,null,null,null,null,null,null,null,null,null,null,null,"2009-05-06"]
[null,null,null,null,null,null,null,null,null,null,null,null,null,null,null,null,null,null,null,null,null,null,null,null,null,null,null,null,null,null,null,null,null,null,null,null,null,null,null,null,null,null,null,null,null,null,null,null,null,null,null,null,null,null,null,null,null,null,null,null,null,null,"2009-05-07"]
[null,null,null,null,null,null,null,null,null,null,null,null,null,null,null,null,null,null,null,null,null,null,null,null,null,null,null,null,null,null,null,null,null,null,null,null,null,null,null,null,null,null,null,null,null,null,null,null,null,null,null,null,null,null,null,null,null,null,null,null,null,null,"2009-05-08"]
[null,null,null,null,null,null,null,null,null,null,null,null,null,null,null,null,null,null,null,null,null,null,null,null,null,null,null,null,null,null,null,null,null,null,null,null,null,null,null,null,null,null,null,null,null,null,null,null,null,null,null,null,null,null,null,null,null,null,null,null,null,null,"2009-05-09"]
[null,null,null,null,null,null,null,null,null,null,null,null,null,null,null,null,null,null,null,null,null,null,null,null,null,null,null,null,null,null,null,null,null,null,null,null,null,null,null,null,null,null,null,null,null,null,null,null,null,null,null,null,null,null,null,null,null,null,null,null,null,null,"2009-05-10"]
[null,null,null,null,null,null,null,null,null,null,null,null,null,null,null,null,null,null,null,null,null,null,null,null,null,null,null,null,null,null,null,null,null,null,null,null,null,null,null,null,null,null,null,null,null,null,null,null,null,null,null,null,null,null,null,null,null,null,null,null,null,null,"2009-05-11"]
[null,null,null,null,null,null,null,null,null,null,null,null,null,null,null,null,null,null,null,null,null,null,null,null,null,null,null,null,null,null,null,null,null,null,null,null,null,null,null,null,null,null,null,null,null,null,null,null,null,null,null,null,null,null,null,null,null,null,null,null,null,null,"2009-05-12"]
[null,null,null,null,null,null,null,null,null,null,null,null,null,null,null,null,null,null,null,null,null,null,null,null,null,null,null,null,null,null,null,null,null,null,null,null,null,null,null,null,null,null,null,null,null,null,null,null,null,null,null,null,null,null,null,null,null,null,null,null,null,null,"2009-05-13"]
[null,null,null,null,null,null,null,null,null,null,null,null,null,null,null,null,null,null,null,null,null,null,null,null,null,null,null,null,null,null,null,null,null,null,null,null,null,null,null,null,null,null,null,null,null,null,null,null,null,null,null,null,null,null,null,null,null,null,null,null,null,null,"2009-05-14"]
[null,null,null,null,null,null,null,null,null,null,null,null,null,null,null,null,null,null,null,null,null,null,null,null,null,null,null,null,null,null,null,null,null,null,null,null,null,null,null,null,null,null,null,null,null,null,null,null,null,null,null,null,null,null,null,null,null,null,null,null,null,null,"2009-05-15"]
[null,null,null,null,null,null,null,null,null,null,null,null,null,null,null,null,null,null,null,null,null,null,null,null,null,null,null,null,null,null,null,null,null,null,null,null,null,null,null,null,null,null,null,null,null,null,null,null,null,null,null,null,null,null,null,null,null,null,null,null,null,null,"2009-05-16"]
[null,null,null,null,null,null,null,null,null,null,null,null,null,null,null,null,null,null,null,null,null,null,null,null,null,null,null,null,null,null,null,null,null,null,null,null,null,null,null,null,null,null,null,null,null,null,null,null,null,null,null,null,null,null,null,null,null,null,null,null,null,null,"2009-05-17"]
[null,null,null,null,null,null,null,null,null,null,null,null,null,null,null,null,null,null,null,null,null,null,null,null,null,null,null,null,null,null,null,null,null,null,null,null,null,null,null,null,null,null,null,null,null,null,null,null,null,null,null,null,null,null,null,null,null,null,null,null,null,null,"2009-05-18"]
[null,null,null,null,null,null,null,null,null,null,null,null,null,null,null,null,null,null,null,null,null,null,null,null,null,null,null,null,null,null,null,null,null,null,null,null,null,null,null,null,null,null,null,null,null,null,null,null,null,null,null,null,null,null,null,null,null,null,null,null,null,null,"2009-05-19"]
[null,null,null,null,null,null,null,null,null,null,null,null,null,null,null,null,null,null,null,null,null,null,null,null,null,null,null,null,null,null,null,null,null,null,null,null,null,null,null,null,null,null,null,null,null,null,null,null,null,null,null,null,null,null,null,null,null,null,null,null,null,null,"2009-05-20"]
[null,null,null,null,null,null,null,null,null,null,null,null,null,null,null,null,null,null,null,null,null,null,null,null,null,null,null,null,null,null,null,null,null,null,null,null,null,null,null,null,null,null,null,null,null,null,null,null,null,null,null,null,null,null,null,null,null,null,null,null,null,null,"2009-05-21"]
[null,null,null,null,null,null,null,null,null,null,null,null,null,null,null,null,null,null,null,null,null,null,null,null,null,null,null,null,null,null,null,null,null,null,null,null,null,null,null,null,null,null,null,null,null,null,null,null,null,null,null,null,null,null,null,null,null,null,null,null,null,null,"2009-05-22"]
[null,null,null,null,null,null,null,null,null,null,null,null,null,null,null,null,null,null,null,null,null,null,null,null,null,null,null,null,null,null,null,null,null,null,null,null,null,null,null,null,null,null,null,null,null,null,null,null,null,null,null,null,null,null,null,null,null,null,null,null,null,null,"2009-05-23"]
[null,null,null,null,null,null,null,null,null,null,null,null,null,null,null,null,null,null,null,null,null,null,null,null,null,null,null,null,null,null,null,null,null,null,null,null,null,null,null,null,null,null,null,null,null,null,null,null,null,null,null,null,null,null,null,null,null,null,null,null,null,null,"2009-05-24"]
[null,null,null,null,null,null,null,null,null,null,null,null,null,null,null,null,null,null,null,null,null,null,null,null,null,null,null,null,null,null,null,null,null,null,null,null,null,null,null,null,null,null,null,null,null,null,null,null,null,null,null,null,null,null,null,null,null,null,null,null,null,null,"2009-05-25"]
[null,null,null,null,null,null,null,null,null,null,null,null,null,null,null,null,null,null,null,null,null,null,null,null,null,null,null,null,null,null,null,null,null,null,null,null,null,null,null,null,null,null,null,null,null,null,null,null,null,null,null,null,null,null,null,null,null,null,null,null,null,null,"2009-05-26"]
[null,null,null,null,null,null,null,null,null,null,null,null,null,null,null,null,null,null,null,null,null,null,null,null,null,null,null,null,null,null,null,null,null,null,null,null,null,null,null,null,null,null,null,null,null,null,null,null,null,null,null,null,null,null,null,null,null,null,null,null,null,null,"2009-05-27"]
[null,null,null,null,null,null,null,null,null,null,null,null,null,null,null,null,null,null,null,null,null,null,null,null,null,null,null,null,null,null,null,null,null,null,null,null,null,null,null,null,null,null,null,null,null,null,null,null,null,null,null,null,null,null,null,null,null,null,null,null,null,null,"2009-05-28"]
[null,null,null,null,null,null,null,null,null,null,null,null,null,null,null,null,null,null,null,null,null,null,null,null,null,null,null,null,null,null,null,null,null,null,null,null,null,null,null,null,null,null,null,null,null,null,null,null,null,null,null,null,null,null,null,null,null,null,null,null,null,null,"2009-05-29"]
[null,null,null,null,null,null,null,null,null,null,null,null,null,null,null,null,null,null,null,null,null,null,null,null,null,null,null,null,null,null,null,null,null,null,null,null,null,null,null,null,null,null,null,null,null,null,null,null,null,null,null,null,null,null,null,null,null,null,null,null,null,null,"2009-05-30"]
[null,null,null,null,null,null,null,null,null,null,null,null,null,null,null,null,null,null,null,null,null,null,null,null,null,null,null,null,null,null,null,null,null,null,null,null,null,null,null,null,null,null,null,null,null,null,null,null,null,null,null,null,null,null,null,null,null,null,null,null,null,null,"2009-05-31"]
[null,null,null,null,null,null,null,null,null,null,null,null,null,null,null,null,null,null,null,null,null,null,null,null,null,null,null,null,null,null,null,null,null,null,null,null,null,null,null,null,null,null,null,null,null,null,null,null,null,null,null,null,null,null,null,null,null,null,null,null,null,null,"2009-06-01"]
[null,null,null,null,null,null,null,null,null,null,null,null,null,null,null,null,null,null,null,null,null,null,null,null,null,null,null,null,null,null,null,null,null,null,null,null,null,null,null,null,null,null,null,null,null,null,null,null,null,null,null,null,null,null,null,null,null,null,null,null,null,null,"2009-06-02"]
[null,null,null,null,null,null,null,null,null,null,null,null,null,null,null,null,null,null,null,null,null,null,null,null,null,null,null,null,null,null,null,null,null,null,null,null,null,null,null,null,null,null,null,null,null,null,null,null,null,null,null,null,null,null,null,null,null,null,null,null,null,null,"2009-06-03"]
[null,null,null,null,null,null,null,null,null,null,null,null,null,null,null,null,null,null,null,null,null,null,null,null,null,null,null,null,null,null,null,null,null,null,null,null,null,null,null,null,null,null,null,null,null,null,null,null,null,null,null,null,null,null,null,null,null,null,null,null,null,null,"2009-06-04"]
[null,null,null,null,null,null,null,null,null,null,null,null,null,null,null,null,null,null,null,null,null,null,null,null,null,null,null,null,null,null,null,null,null,null,null,null,null,null,null,null,null,null,null,null,null,null,null,null,null,null,null,null,null,null,null,null,null,null,null,null,null,null,"2009-06-05"]
[null,null,null,null,null,null,null,null,null,null,null,null,null,null,null,null,null,null,null,null,null,null,null,null,null,null,null,null,null,null,null,null,null,null,null,null,null,null,null,null,null,null,null,null,null,null,null,null,null,null,null,null,null,null,null,null,null,null,null,null,null,null,"2009-06-06"]
[null,null,null,null,null,null,null,null,null,null,null,null,null,null,null,null,null,null,null,null,null,null,null,null,null,null,null,null,null,null,null,null,null,null,null,null,null,null,null,null,null,null,null,null,null,null,null,null,null,null,null,null,null,null,null,null,null,null,null,null,null,null,"2009-06-07"]
[null,null,null,null,null,null,null,null,null,null,null,null,null,null,null,null,null,null,null,null,null,null,null,null,null,null,null,null,null,null,null,null,null,null,null,null,null,null,null,null,null,null,null,null,null,null,null,null,null,null,null,null,null,null,null,null,null,null,null,null,null,null,"2009-06-08"]
[null,null,null,null,null,null,null,null,null,null,null,null,null,null,null,null,null,null,null,null,null,null,null,null,null,null,null,null,null,null,null,null,null,null,null,null,null,null,null,null,null,null,null,null,null,null,null,null,null,null,null,null,null,null,null,null,null,null,null,null,null,null,"2009-06-09"]
[null,null,null,null,null,null,null,null,null,null,null,null,null,null,null,null,null,null,null,null,null,null,null,null,null,null,null,null,null,null,null,null,null,null,null,null,null,null,null,null,null,null,null,null,null,null,null,null,null,null,null,null,null,null,null,null,null,null,null,null,null,null,"2009-06-10"]
[null,null,null,null,null,null,null,null,null,null,null,null,null,null,null,null,null,null,null,null,null,null,null,null,null,null,null,null,null,null,null,null,null,null,null,null,null,null,null,null,null,null,null,null,null,null,null,null,null,null,null,null,null,null,null,null,null,null,null,null,null,null,"2009-06-11"]
[null,null,null,null,null,null,null,null,null,null,null,null,null,null,null,null,null,null,null,null,null,null,null,null,null,null,null,null,null,null,null,null,null,null,null,null,null,null,null,null,null,null,null,null,null,null,null,null,null,null,null,null,null,null,null,null,null,null,null,null,null,null,"2009-06-12"]
[null,null,null,null,null,null,null,null,null,null,null,null,null,null,null,null,null,null,null,null,null,null,null,null,null,null,null,null,null,null,null,null,null,null,null,null,null,null,null,null,null,null,null,null,null,null,null,null,null,null,null,null,null,null,null,null,null,null,null,null,null,null,"2009-06-13"]
[null,null,null,null,null,null,null,null,null,null,null,null,null,null,null,null,null,null,null,null,null,null,null,null,null,null,null,null,null,null,null,null,null,null,null,null,null,null,null,null,null,null,null,null,null,null,null,null,null,null,null,null,null,null,null,null,null,null,null,null,null,null,"2009-06-14"]
[null,null,null,null,null,null,null,null,null,null,null,null,null,null,null,null,null,null,null,null,null,null,null,null,null,null,null,null,null,null,null,null,null,null,null,null,null,null,null,null,null,null,null,null,null,null,null,null,null,null,null,null,null,null,null,null,null,null,null,null,null,null,"2009-06-15"]
[null,null,null,null,null,null,null,null,null,null,null,null,null,null,null,null,null,null,null,null,null,null,null,null,null,null,null,null,null,null,null,null,null,null,null,null,null,null,null,null,null,null,null,null,null,null,null,null,null,null,null,null,null,null,null,null,null,null,null,null,null,null,"2009-06-16"]
[null,null,null,null,null,null,null,null,null,null,null,null,null,null,null,null,null,null,null,null,null,null,null,null,null,null,null,null,null,null,null,null,null,null,null,null,null,null,null,null,null,null,null,null,null,null,null,null,null,null,null,null,null,null,null,null,null,null,null,null,null,null,"2009-06-17"]
[null,null,null,null,null,null,null,null,null,null,null,null,null,null,null,null,null,null,null,null,null,null,null,null,null,null,null,null,null,null,null,null,null,null,null,null,null,null,null,null,null,null,null,null,null,null,null,null,null,null,null,null,null,null,null,null,null,null,null,null,null,null,"2009-06-18"]
[null,null,null,null,null,null,null,null,null,null,null,null,null,null,null,null,null,null,null,null,null,null,null,null,null,null,null,null,null,null,null,null,null,null,null,null,null,null,null,null,null,null,null,null,null,null,null,null,null,null,null,null,null,null,null,null,null,null,null,null,null,null,"2009-06-19"]
[null,null,null,null,null,null,null,null,null,null,null,null,null,null,null,null,null,null,null,null,null,null,null,null,null,null,null,null,null,null,null,null,null,null,null,null,null,null,null,null,null,null,null,null,null,null,null,null,null,null,null,null,null,null,null,null,null,null,null,null,null,null,"2009-06-20"]
[null,null,null,null,null,null,null,null,null,null,null,null,null,null,null,null,null,null,null,null,null,null,null,null,null,null,null,null,null,null,null,null,null,null,null,null,null,null,null,null,null,null,null,null,null,null,null,null,null,null,null,null,null,null,null,null,null,null,null,null,null,null,"2009-06-21"]
[null,null,null,null,null,null,null,null,null,null,null,null,null,null,null,null,null,null,null,null,null,null,null,null,null,null,null,null,null,null,null,null,null,null,null,null,null,null,null,null,null,null,null,null,null,null,null,null,null,null,null,null,null,null,null,null,null,null,null,null,null,null,"2009-06-22"]
[null,null,null,null,null,null,null,null,null,null,null,null,null,null,null,null,null,null,null,null,null,null,null,null,null,null,null,null,null,null,null,null,null,null,null,null,null,null,null,null,null,null,null,null,null,null,null,null,null,null,null,null,null,null,null,null,null,null,null,null,null,null,"2009-06-23"]
[null,null,null,null,null,null,null,null,null,null,null,null,null,null,null,null,null,null,null,null,null,null,null,null,null,null,null,null,null,null,null,null,null,null,null,null,null,null,null,null,null,null,null,null,null,null,null,null,null,null,null,null,null,null,null,null,null,null,null,null,null,null,"2009-06-24"]
[null,null,null,null,null,null,null,null,null,null,null,null,null,null,null,null,null,null,null,null,null,null,null,null,null,null,null,null,null,null,null,null,null,null,null,null,null,null,null,null,null,null,null,null,null,null,null,null,null,null,null,null,null,null,null,null,null,null,null,null,null,null,"2009-06-25"]
[null,null,null,null,null,null,null,null,null,null,null,null,null,null,null,null,null,null,null,null,null,null,null,null,null,null,null,null,null,null,null,null,null,null,null,null,null,null,null,null,null,null,null,null,null,null,null,null,null,null,null,null,null,null,null,null,null,null,null,null,null,null,"2009-06-26"]
[null,null,null,null,null,null,null,null,null,null,null,null,null,null,null,null,null,null,null,null,null,null,null,null,null,null,null,null,null,null,null,null,null,null,null,null,null,null,null,null,null,null,null,null,null,null,null,null,null,null,null,null,null,null,null,null,null,null,null,null,null,null,"2009-06-27"]
[null,null,null,null,null,null,null,null,null,null,null,null,null,null,null,null,null,null,null,null,null,null,null,null,null,null,null,null,null,null,null,null,null,null,null,null,null,null,null,null,null,null,null,null,null,null,null,null,null,null,null,null,null,null,null,null,null,null,null,null,null,null,"2009-06-28"]
[null,null,null,null,null,null,null,null,null,null,null,null,null,null,null,null,null,null,null,null,null,null,null,null,null,null,null,null,null,null,null,null,null,null,null,null,null,null,null,null,null,null,null,null,null,null,null,null,null,null,null,null,null,null,null,null,null,null,null,null,null,null,"2009-06-29"]
[null,null,null,null,null,null,null,null,null,null,null,null,null,null,null,null,null,null,null,null,null,null,null,null,null,null,null,null,null,null,null,null,null,null,null,null,null,null,null,null,null,null,null,null,null,null,null,null,null,null,null,null,null,null,null,null,null,null,null,null,null,null,"2009-06-30"]
[null,null,null,null,null,null,null,null,null,null,null,null,null,null,null,null,null,null,null,null,null,null,null,null,null,null,null,null,null,null,null,null,null,null,null,null,null,null,null,null,null,null,null,null,null,null,null,null,null,null,null,null,null,null,null,null,null,null,null,null,null,null,"2009-07-01"]
[null,null,null,null,null,null,null,null,null,null,null,null,null,null,null,null,null,null,null,null,null,null,null,null,null,null,null,null,null,null,null,null,null,null,null,null,null,null,null,null,null,null,null,null,null,null,null,null,null,null,null,null,null,null,null,null,null,null,null,null,null,null,"2009-07-02"]
[null,null,null,null,null,null,null,null,null,null,null,null,null,null,null,null,null,null,null,null,null,null,null,null,null,null,null,null,null,null,null,null,null,null,null,null,null,null,null,null,null,null,null,null,null,null,null,null,null,null,null,null,null,null,null,null,null,null,null,null,null,null,"2009-07-03"]
[null,null,null,null,null,null,null,null,null,null,null,null,null,null,null,null,null,null,null,null,null,null,null,null,null,null,null,null,null,null,null,null,null,null,null,null,null,null,null,null,null,null,null,null,null,null,null,null,null,null,null,null,null,null,null,null,null,null,null,null,null,null,"2009-07-04"]
[null,null,null,null,null,null,null,null,null,null,null,null,null,null,null,null,null,null,null,null,null,null,null,null,null,null,null,null,null,null,null,null,null,null,null,null,null,null,null,null,null,null,null,null,null,null,null,null,null,null,null,null,null,null,null,null,null,null,null,null,null,null,"2009-07-05"]
[null,null,null,null,null,null,null,null,null,null,null,null,null,null,null,null,null,null,null,null,null,null,null,null,null,null,null,null,null,null,null,null,null,null,null,null,null,null,null,null,null,null,null,null,null,null,null,null,null,null,null,null,null,null,null,null,null,null,null,null,null,null,"2009-07-06"]
[null,null,null,null,null,null,null,null,null,null,null,null,null,null,null,null,null,null,null,null,null,null,null,null,null,null,null,null,null,null,null,null,null,null,null,null,null,null,null,null,null,null,null,null,null,null,null,null,null,null,null,null,null,null,null,null,null,null,null,null,null,null,"2009-07-07"]
[null,null,null,null,null,null,null,null,null,null,null,null,null,null,null,null,null,null,null,null,null,null,null,null,null,null,null,null,null,null,null,null,null,null,null,null,null,null,null,null,null,null,null,null,null,null,null,null,null,null,null,null,null,null,null,null,null,null,null,null,null,null,"2009-07-08"]
[null,null,null,null,null,null,null,null,null,null,null,null,null,null,null,null,null,null,null,null,null,null,null,null,null,null,null,null,null,null,null,null,null,null,null,null,null,null,null,null,null,null,null,null,null,null,null,null,null,null,null,null,null,null,null,null,null,null,null,null,null,null,"2009-07-09"]
[null,null,null,null,null,null,null,null,null,null,null,null,null,null,null,null,null,null,null,null,null,null,null,null,null,null,null,null,null,null,null,null,null,null,null,null,null,null,null,null,null,null,null,null,null,null,null,null,null,null,null,null,null,null,null,null,null,null,null,null,null,null,"2009-07-10"]
[null,null,null,null,null,null,null,null,null,null,null,null,null,null,null,null,null,null,null,null,null,null,null,null,null,null,null,null,null,null,null,null,null,null,null,null,null,null,null,null,null,null,null,null,null,null,null,null,null,null,null,null,null,null,null,null,null,null,null,null,null,null,"2009-07-11"]
[null,null,null,null,null,null,null,null,null,null,null,null,null,null,null,null,null,null,null,null,null,null,null,null,null,null,null,null,null,null,null,null,null,null,null,null,null,null,null,null,null,null,null,null,null,null,null,null,null,null,null,null,null,null,null,null,null,null,null,null,null,null,"2009-07-12"]
[null,null,null,null,null,null,null,null,null,null,null,null,null,null,null,null,null,null,null,null,null,null,null,null,null,null,null,null,null,null,null,null,null,null,null,null,null,null,null,null,null,null,null,null,null,null,null,null,null,null,null,null,null,null,null,null,null,null,null,null,null,null,"2009-07-13"]
[null,null,null,null,null,null,null,null,null,null,null,null,null,null,null,null,null,null,null,null,null,null,null,null,null,null,null,null,null,null,null,null,null,null,null,null,null,null,null,null,null,null,null,null,null,null,null,null,null,null,null,null,null,null,null,null,null,null,null,null,null,null,"2009-07-14"]
[null,null,null,null,null,null,null,null,null,null,null,null,null,null,null,null,null,null,null,null,null,null,null,null,null,null,null,null,null,null,null,null,null,null,null,null,null,null,null,null,null,null,null,null,null,null,null,null,null,null,null,null,null,null,null,null,null,null,null,null,null,null,"2009-07-15"]
[null,null,null,null,null,null,null,null,null,null,null,null,null,null,null,null,null,null,null,null,null,null,null,null,null,null,null,null,null,null,null,null,null,null,null,null,null,null,null,null,null,null,null,null,null,null,null,null,null,null,null,null,null,null,null,null,null,null,null,null,null,null,"2009-07-16"]
[null,null,null,null,null,null,null,null,null,null,null,null,null,null,null,null,null,null,null,null,null,null,null,null,null,null,null,null,null,null,null,null,null,null,null,null,null,null,null,null,null,null,null,null,null,null,null,null,null,null,null,null,null,null,null,null,null,null,null,null,null,null,"2009-07-17"]
[null,null,null,null,null,null,null,null,null,null,null,null,null,null,null,null,null,null,null,null,null,null,null,null,null,null,null,null,null,null,null,null,null,null,null,null,null,null,null,null,null,null,null,null,null,null,null,null,null,null,null,null,null,null,null,null,null,null,null,null,null,null,"2009-07-18"]
[null,null,null,null,null,null,null,null,null,null,null,null,null,null,null,null,null,null,null,null,null,null,null,null,null,null,null,null,null,null,null,null,null,null,null,null,null,null,null,null,null,null,null,null,null,null,null,null,null,null,null,null,null,null,null,null,null,null,null,null,null,null,"2009-07-19"]
[null,null,null,null,null,null,null,null,null,null,null,null,null,null,null,null,null,null,null,null,null,null,null,null,null,null,null,null,null,null,null,null,null,null,null,null,null,null,null,null,null,null,null,null,null,null,null,null,null,null,null,null,null,null,null,null,null,null,null,null,null,null,"2009-07-20"]
[null,null,null,null,null,null,null,null,null,null,null,null,null,null,null,null,null,null,null,null,null,null,null,null,null,null,null,null,null,null,null,null,null,null,null,null,null,null,null,null,null,null,null,null,null,null,null,null,null,null,null,null,null,null,null,null,null,null,null,null,null,null,"2009-07-21"]
[null,null,null,null,null,null,null,null,null,null,null,null,null,null,null,null,null,null,null,null,null,null,null,null,null,null,null,null,null,null,null,null,null,null,null,null,null,null,null,null,null,null,null,null,null,null,null,null,null,null,null,null,null,null,null,null,null,null,null,null,null,null,"2009-07-22"]
[null,null,null,null,null,null,null,null,null,null,null,null,null,null,null,null,null,null,null,null,null,null,null,null,null,null,null,null,null,null,null,null,null,null,null,null,null,null,null,null,null,null,null,null,null,null,null,null,null,null,null,null,null,null,null,null,null,null,null,null,null,null,"2009-07-23"]
[null,null,null,null,null,null,null,null,null,null,null,null,null,null,null,null,null,null,null,null,null,null,null,null,null,null,null,null,null,null,null,null,null,null,null,null,null,null,null,null,null,null,null,null,null,null,null,null,null,null,null,null,null,null,null,null,null,null,null,null,null,null,"2009-07-24"]
[null,null,null,null,null,null,null,null,null,null,null,null,null,null,null,null,null,null,null,null,null,null,null,null,null,null,null,null,null,null,null,null,null,null,null,null,null,null,null,null,null,null,null,null,null,null,null,null,null,null,null,null,null,null,null,null,null,null,null,null,null,null,"2009-07-25"]
[null,null,null,null,null,null,null,null,null,null,null,null,null,null,null,null,null,null,null,null,null,null,null,null,null,null,null,null,null,null,null,null,null,null,null,null,null,null,null,null,null,null,null,null,null,null,null,null,null,null,null,null,null,null,null,null,null,null,null,null,null,null,"2009-07-26"]
[null,null,null,null,null,null,null,null,null,null,null,null,null,null,null,null,null,null,null,null,null,null,null,null,null,null,null,null,null,null,null,null,null,null,null,null,null,null,null,null,null,null,null,null,null,null,null,null,null,null,null,null,null,null,null,null,null,null,null,null,null,null,"2009-07-27"]
[null,null,null,null,null,null,null,null,null,null,null,null,null,null,null,null,null,null,null,null,null,null,null,null,null,null,null,null,null,null,null,null,null,null,null,null,null,null,null,null,null,null,null,null,null,null,null,null,null,null,null,null,null,null,null,null,null,null,null,null,null,null,"2009-07-28"]
[null,null,null,null,null,null,null,null,null,null,null,null,null,null,null,null,null,null,null,null,null,null,null,null,null,null,null,null,null,null,null,null,null,null,null,null,null,null,null,null,null,null,null,null,null,null,null,null,null,null,null,null,null,null,null,null,null,null,null,null,null,null,"2009-07-29"]
[null,null,null,null,null,null,null,null,null,null,null,null,null,null,null,null,null,null,null,null,null,null,null,null,null,null,null,null,null,null,null,null,null,null,null,null,null,null,null,null,null,null,null,null,null,null,null,null,null,null,null,null,null,null,null,null,null,null,null,null,null,null,"2009-07-30"]
[null,null,null,null,null,null,null,null,null,null,null,null,null,null,null,null,null,null,null,null,null,null,null,null,null,null,null,null,null,null,null,null,null,null,null,null,null,null,null,null,null,null,null,null,null,null,null,null,null,null,null,null,null,null,null,null,null,null,null,null,null,null,"2009-07-31"]
[null,null,null,null,null,null,null,null,null,null,null,null,null,null,null,null,null,null,null,null,null,null,null,null,null,null,null,null,null,null,null,null,null,null,null,null,null,null,null,null,null,null,null,null,null,null,null,null,null,null,null,null,null,null,null,null,null,null,null,null,null,null,"2009-08-01"]
[null,null,null,null,null,null,null,null,null,null,null,null,null,null,null,null,null,null,null,null,null,null,null,null,null,null,null,null,null,null,null,null,null,null,null,null,null,null,null,null,null,null,null,null,null,null,null,null,null,null,null,null,null,null,null,null,null,null,null,null,null,null,"2009-08-02"]
[null,null,null,null,null,null,null,null,null,null,null,null,null,null,null,null,null,null,null,null,null,null,null,null,null,null,null,null,null,null,null,null,null,null,null,null,null,null,null,null,null,null,null,null,null,null,null,null,null,null,null,null,null,null,null,null,null,null,null,null,null,null,"2009-08-03"]
[null,null,null,null,null,null,null,null,null,null,null,null,null,null,null,null,null,null,null,null,null,null,null,null,null,null,null,null,null,null,null,null,null,null,null,null,null,null,null,null,null,null,null,null,null,null,null,null,null,null,null,null,null,null,null,null,null,null,null,null,null,null,"2009-08-04"]
[null,null,null,null,null,null,null,null,null,null,null,null,null,null,null,null,null,null,null,null,null,null,null,null,null,null,null,null,null,null,null,null,null,null,null,null,null,null,null,null,null,null,null,null,null,null,null,null,null,null,null,null,null,null,null,null,null,null,null,null,null,null,"2009-08-05"]
[null,null,null,null,null,null,null,null,null,null,null,null,null,null,null,null,null,null,null,null,null,null,null,null,null,null,null,null,null,null,null,null,null,null,null,null,null,null,null,null,null,null,null,null,null,null,null,null,null,null,null,null,null,null,null,null,null,null,null,null,null,null,"2009-08-06"]
[null,null,null,null,null,null,null,null,null,null,null,null,null,null,null,null,null,null,null,null,null,null,null,null,null,null,null,null,null,null,null,null,null,null,null,null,null,null,null,null,null,null,null,null,null,null,null,null,null,null,null,null,null,null,null,null,null,null,null,null,null,null,"2009-08-07"]
[null,null,null,null,null,null,null,null,null,null,null,null,null,null,null,null,null,null,null,null,null,null,null,null,null,null,null,null,null,null,null,null,null,null,null,null,null,null,null,null,null,null,null,null,null,null,null,null,null,null,null,null,null,null,null,null,null,null,null,null,null,null,"2009-08-08"]
[null,null,null,null,null,null,null,null,null,null,null,null,null,null,null,null,null,null,null,null,null,null,null,null,null,null,null,null,null,null,null,null,null,null,null,null,null,null,null,null,null,null,null,null,null,null,null,null,null,null,null,null,null,null,null,null,null,null,null,null,null,null,"2009-08-09"]
[null,null,null,null,null,null,null,null,null,null,null,null,null,null,null,null,null,null,null,null,null,null,null,null,null,null,null,null,null,null,null,null,null,null,null,null,null,null,null,null,null,null,null,null,null,null,null,null,null,null,null,null,null,null,null,null,null,null,null,null,null,null,"2009-08-10"]
[null,null,null,null,null,null,null,null,null,null,null,null,null,null,null,null,null,null,null,null,null,null,null,null,null,null,null,null,null,null,null,null,null,null,null,null,null,null,null,null,null,null,null,null,null,null,null,null,null,null,null,null,null,null,null,null,null,null,null,null,null,null,"2009-08-11"]
[null,null,null,null,null,null,null,null,null,null,null,null,null,null,null,null,null,null,null,null,null,null,null,null,null,null,null,null,null,null,null,null,null,null,null,null,null,null,null,null,null,null,null,null,null,null,null,null,null,null,null,null,null,null,null,null,null,null,null,null,null,null,"2009-08-12"]
[null,null,null,null,null,null,null,null,null,null,null,null,null,null,null,null,null,null,null,null,null,null,null,null,null,null,null,null,null,null,null,null,null,null,null,null,null,null,null,null,null,null,null,null,null,null,null,null,null,null,null,null,null,null,null,null,null,null,null,null,null,null,"2009-08-13"]
[null,null,null,null,null,null,null,null,null,null,null,null,null,null,null,null,null,null,null,null,null,null,null,null,null,null,null,null,null,null,null,null,null,null,null,null,null,null,null,null,null,null,null,null,null,null,null,null,null,null,null,null,null,null,null,null,null,null,null,null,null,null,"2009-08-14"]
[null,null,null,null,null,null,null,null,null,null,null,null,null,null,null,null,null,null,null,null,null,null,null,null,null,null,null,null,null,null,null,null,null,null,null,null,null,null,null,null,null,null,null,null,null,null,null,null,null,null,null,null,null,null,null,null,null,null,null,null,null,null,"2009-08-15"]
[null,null,null,null,null,null,null,null,null,null,null,null,null,null,null,null,null,null,null,null,null,null,null,null,null,null,null,null,null,null,null,null,null,null,null,null,null,null,null,null,null,null,null,null,null,null,null,null,null,null,null,null,null,null,null,null,null,null,null,null,null,null,"2009-08-16"]
[null,null,null,null,null,null,null,null,null,null,null,null,null,null,null,null,null,null,null,null,null,null,null,null,null,null,null,null,null,null,null,null,null,null,null,null,null,null,null,null,null,null,null,null,null,null,null,null,null,null,null,null,null,null,null,null,null,null,null,null,null,null,"2009-08-17"]
[null,null,null,null,null,null,null,null,null,null,null,null,null,null,null,null,null,null,null,null,null,null,null,null,null,null,null,null,null,null,null,null,null,null,null,null,null,null,null,null,null,null,null,null,null,null,null,null,null,null,null,null,null,null,null,null,null,null,null,null,null,null,"2009-08-18"]
[null,null,null,null,null,null,null,null,null,null,null,null,null,null,null,null,null,null,null,null,null,null,null,null,null,null,null,null,null,null,null,null,null,null,null,null,null,null,null,null,null,null,null,null,null,null,null,null,null,null,null,null,null,null,null,null,null,null,null,null,null,null,"2009-08-19"]
[null,null,null,null,null,null,null,null,null,null,null,null,null,null,null,null,null,null,null,null,null,null,null,null,null,null,null,null,null,null,null,null,null,null,null,null,null,null,null,null,null,null,null,null,null,null,null,null,null,null,null,null,null,null,null,null,null,null,null,null,null,null,"2009-08-20"]
[null,null,null,null,null,null,null,null,null,null,null,null,null,null,null,null,null,null,null,null,null,null,null,null,null,null,null,null,null,null,null,null,null,null,null,null,null,null,null,null,null,null,null,null,null,null,null,null,null,null,null,null,null,null,null,null,null,null,null,null,null,null,"2009-08-21"]
[null,null,null,null,null,null,null,null,null,null,null,null,null,null,null,null,null,null,null,null,null,null,null,null,null,null,null,null,null,null,null,null,null,null,null,null,null,null,null,null,null,null,null,null,null,null,null,null,null,null,null,null,null,null,null,null,null,null,null,null,null,null,"2009-08-22"]
[null,null,null,null,null,null,null,null,null,null,null,null,null,null,null,null,null,null,null,null,null,null,null,null,null,null,null,null,null,null,null,null,null,null,null,null,null,null,null,null,null,null,null,null,null,null,null,null,null,null,null,null,null,null,null,null,null,null,null,null,null,null,"2009-08-23"]
[null,null,null,null,null,null,null,null,null,null,null,null,null,null,null,null,null,null,null,null,null,null,null,null,null,null,null,null,null,null,null,null,null,null,null,null,null,null,null,null,null,null,null,null,null,null,null,null,null,null,null,null,null,null,null,null,null,null,null,null,null,null,"2009-08-24"]
[null,null,null,null,null,null,null,null,null,null,null,null,null,null,null,null,null,null,null,null,null,null,null,null,null,null,null,null,null,null,null,null,null,null,null,null,null,null,null,null,null,null,null,null,null,null,null,null,null,null,null,null,null,null,null,null,null,null,null,null,null,null,"2009-08-25"]
[null,null,null,null,null,null,null,null,null,null,null,null,null,null,null,null,null,null,null,null,null,null,null,null,null,null,null,null,null,null,null,null,null,null,null,null,null,null,null,null,null,null,null,null,null,null,null,null,null,null,null,null,null,null,null,null,null,null,null,null,null,null,"2009-08-26"]
[null,null,null,null,null,null,null,null,null,null,null,null,null,null,null,null,null,null,null,null,null,null,null,null,null,null,null,null,null,null,null,null,null,null,null,null,null,null,null,null,null,null,null,null,null,null,null,null,null,null,null,null,null,null,null,null,null,null,null,null,null,null,"2009-08-27"]
[null,null,null,null,null,null,null,null,null,null,null,null,null,null,null,null,null,null,null,null,null,null,null,null,null,null,null,null,null,null,null,null,null,null,null,null,null,null,null,null,null,null,null,null,null,null,null,null,null,null,null,null,null,null,null,null,null,null,null,null,null,null,"2009-08-28"]
[null,null,null,null,null,null,null,null,null,null,null,null,null,null,null,null,null,null,null,null,null,null,null,null,null,null,null,null,null,null,null,null,null,null,null,null,null,null,null,null,null,null,null,null,null,null,null,null,null,null,null,null,null,null,null,null,null,null,null,null,null,null,"2009-08-29"]
[null,null,null,null,null,null,null,null,null,null,null,null,null,null,null,null,null,null,null,null,null,null,null,null,null,null,null,null,null,null,null,null,null,null,null,null,null,null,null,null,null,null,null,null,null,null,null,null,null,null,null,null,null,null,null,null,null,null,null,null,null,null,"2009-08-30"]
[null,null,null,null,null,null,null,null,null,null,null,null,null,null,null,null,null,null,null,null,null,null,null,null,null,null,null,null,null,null,null,null,null,null,null,null,null,null,null,null,null,null,null,null,null,null,null,null,null,null,null,null,null,null,null,null,null,null,null,null,null,null,"2009-08-31"]
[null,null,null,null,null,null,null,null,null,null,null,null,null,null,null,null,null,null,null,null,null,null,null,null,null,null,null,null,null,null,null,null,null,null,null,null,null,null,null,null,null,null,null,null,null,null,null,null,null,null,null,null,null,null,null,null,null,null,null,null,null,null,"2009-09-01"]
[null,null,null,null,null,null,null,null,null,null,null,null,null,null,null,null,null,null,null,null,null,null,null,null,null,null,null,null,null,null,null,null,null,null,null,null,null,null,null,null,null,null,null,null,null,null,null,null,null,null,null,null,null,null,null,null,null,null,null,null,null,null,"2009-09-02"]
[null,null,null,null,null,null,null,null,null,null,null,null,null,null,null,null,null,null,null,null,null,null,null,null,null,null,null,null,null,null,null,null,null,null,null,null,null,null,null,null,null,null,null,null,null,null,null,null,null,null,null,null,null,null,null,null,null,null,null,null,null,null,"2009-09-03"]
[null,null,null,null,null,null,null,null,null,null,null,null,null,null,null,null,null,null,null,null,null,null,null,null,null,null,null,null,null,null,null,null,null,null,null,null,null,null,null,null,null,null,null,null,null,null,null,null,null,null,null,null,null,null,null,null,null,null,null,null,null,null,"2009-09-04"]
[null,null,null,null,null,null,null,null,null,null,null,null,null,null,null,null,null,null,null,null,null,null,null,null,null,null,null,null,null,null,null,null,null,null,null,null,null,null,null,null,null,null,null,null,null,null,null,null,null,null,null,null,null,null,null,null,null,null,null,null,null,null,"2009-09-05"]
[null,null,null,null,null,null,null,null,null,null,null,null,null,null,null,null,null,null,null,null,null,null,null,null,null,null,null,null,null,null,null,null,null,null,null,null,null,null,null,null,null,null,null,null,null,null,null,null,null,null,null,null,null,null,null,null,null,null,null,null,null,null,"2009-09-06"]
[null,null,null,null,null,null,null,null,null,null,null,null,null,null,null,null,null,null,null,null,null,null,null,null,null,null,null,null,null,null,null,null,null,null,null,null,null,null,null,null,null,null,null,null,null,null,null,null,null,null,null,null,null,null,null,null,null,null,null,null,null,null,"2009-09-07"]
[null,null,null,null,null,null,null,null,null,null,null,null,null,null,null,null,null,null,null,null,null,null,null,null,null,null,null,null,null,null,null,null,null,null,null,null,null,null,null,null,null,null,null,null,null,null,null,null,null,null,null,null,null,null,null,null,null,null,null,null,null,null,"2009-09-08"]
[null,null,null,null,null,null,null,null,null,null,null,null,null,null,null,null,null,null,null,null,null,null,null,null,null,null,null,null,null,null,null,null,null,null,null,null,null,null,null,null,null,null,null,null,null,null,null,null,null,null,null,null,null,null,null,null,null,null,null,null,null,null,"2009-09-09"]
[null,null,null,null,null,null,null,null,null,null,null,null,null,null,null,null,null,null,null,null,null,null,null,null,null,null,null,null,null,null,null,null,null,null,null,null,null,null,null,null,null,null,null,null,null,null,null,null,null,null,null,null,null,null,null,null,null,null,null,null,null,null,"2009-09-10"]
[null,null,null,null,null,null,null,null,null,null,null,null,null,null,null,null,null,null,null,null,null,null,null,null,null,null,null,null,null,null,null,null,null,null,null,null,null,null,null,null,null,null,null,null,null,null,null,null,null,null,null,null,null,null,null,null,null,null,null,null,null,null,"2009-09-11"]
[null,null,null,null,null,null,null,null,null,null,null,null,null,null,null,null,null,null,null,null,null,null,null,null,null,null,null,null,null,null,null,null,null,null,null,null,null,null,null,null,null,null,null,null,null,null,null,null,null,null,null,null,null,null,null,null,null,null,null,null,null,null,"2009-09-12"]
[null,null,null,null,null,null,null,null,null,null,null,null,null,null,null,null,null,null,null,null,null,null,null,null,null,null,null,null,null,null,null,null,null,null,null,null,null,null,null,null,null,null,null,null,null,null,null,null,null,null,null,null,null,null,null,null,null,null,null,null,null,null,"2009-09-13"]
[null,null,null,null,null,null,null,null,null,null,null,null,null,null,null,null,null,null,null,null,null,null,null,null,null,null,null,null,null,null,null,null,null,null,null,null,null,null,null,null,null,null,null,null,null,null,null,null,null,null,null,null,null,null,null,null,null,null,null,null,null,null,"2009-09-14"]
[null,null,null,null,null,null,null,null,null,null,null,null,null,null,null,null,null,null,null,null,null,null,null,null,null,null,null,null,null,null,null,null,null,null,null,null,null,null,null,null,null,null,null,null,null,null,null,null,null,null,null,null,null,null,null,null,null,null,null,null,null,null,"2009-09-15"]
[null,null,null,null,null,null,null,null,null,null,null,null,null,null,null,null,null,null,null,null,null,null,null,null,null,null,null,null,null,null,null,null,null,null,null,null,null,null,null,null,null,null,null,null,null,null,null,null,null,null,null,null,null,null,null,null,null,null,null,null,null,null,"2009-09-16"]
[null,null,null,null,null,null,null,null,null,null,null,null,null,null,null,null,null,null,null,null,null,null,null,null,null,null,null,null,null,null,null,null,null,null,null,null,null,null,null,null,null,null,null,null,null,null,null,null,null,null,null,null,null,null,null,null,null,null,null,null,null,null,"2009-09-17"]
[null,null,null,null,null,null,null,null,null,null,null,null,null,null,null,null,null,null,null,null,null,null,null,null,null,null,null,null,null,null,null,null,null,null,null,null,null,null,null,null,null,null,null,null,null,null,null,null,null,null,null,null,null,null,null,null,null,null,null,null,null,null,"2009-09-18"]
[null,null,null,null,null,null,null,null,null,null,null,null,null,null,null,null,null,null,null,null,null,null,null,null,null,null,null,null,null,null,null,null,null,null,null,null,null,null,null,null,null,null,null,null,null,null,null,null,null,null,null,null,null,null,null,null,null,null,null,null,null,null,"2009-09-19"]
[null,null,null,null,null,null,null,null,null,null,null,null,null,null,null,null,null,null,null,null,null,null,null,null,null,null,null,null,null,null,null,null,null,null,null,null,null,null,null,null,null,null,null,null,null,null,null,null,null,null,null,null,null,null,null,null,null,null,null,null,null,null,"2009-09-20"]
[null,null,null,null,null,null,null,null,null,null,null,null,null,null,null,null,null,null,null,null,null,null,null,null,null,null,null,null,null,null,null,null,null,null,null,null,null,null,null,null,null,null,null,null,null,null,null,null,null,null,null,null,null,null,null,null,null,null,null,null,null,null,"2009-09-21"]
[null,null,null,null,null,null,null,null,null,null,null,null,null,null,null,null,null,null,null,null,null,null,null,null,null,null,null,null,null,null,null,null,null,null,null,null,null,null,null,null,null,null,null,null,null,null,null,null,null,null,null,null,null,null,null,null,null,null,null,null,null,null,"2009-09-22"]
[null,null,null,null,null,null,null,null,null,null,null,null,null,null,null,null,null,null,null,null,null,null,null,null,null,null,null,null,null,null,null,null,null,null,null,null,null,null,null,null,null,null,null,null,null,null,null,null,null,null,null,null,null,null,null,null,null,null,null,null,null,null,"2009-09-23"]
[null,null,null,null,null,null,null,null,null,null,null,null,null,null,null,null,null,null,null,null,null,null,null,null,null,null,null,null,null,null,null,null,null,null,null,null,null,null,null,null,null,null,null,null,null,null,null,null,null,null,null,null,null,null,null,null,null,null,null,null,null,null,"2009-09-24"]
[null,null,null,null,null,null,null,null,null,null,null,null,null,null,null,null,null,null,null,null,null,null,null,null,null,null,null,null,null,null,null,null,null,null,null,null,null,null,null,null,null,null,null,null,null,null,null,null,null,null,null,null,null,null,null,null,null,null,null,null,null,null,"2009-09-25"]
[null,null,null,null,null,null,null,null,null,null,null,null,null,null,null,null,null,null,null,null,null,null,null,null,null,null,null,null,null,null,null,null,null,null,null,null,null,null,null,null,null,null,null,null,null,null,null,null,null,null,null,null,null,null,null,null,null,null,null,null,null,null,"2009-09-26"]
[null,null,null,null,null,null,null,null,null,null,null,null,null,null,null,null,null,null,null,null,null,null,null,null,null,null,null,null,null,null,null,null,null,null,null,null,null,null,null,null,null,null,null,null,null,null,null,null,null,null,null,null,null,null,null,null,null,null,null,null,null,null,"2009-09-27"]
[null,null,null,null,null,null,null,null,null,null,null,null,null,null,null,null,null,null,null,null,null,null,null,null,null,null,null,null,null,null,null,null,null,null,null,null,null,null,null,null,null,null,null,null,null,null,null,null,null,null,null,null,null,null,null,null,null,null,null,null,null,null,"2009-09-28"]
[null,null,null,null,null,null,null,null,null,null,null,null,null,null,null,null,null,null,null,null,null,null,null,null,null,null,null,null,null,null,null,null,null,null,null,null,null,null,null,null,null,null,null,null,null,null,null,null,null,null,null,null,null,null,null,null,null,null,null,null,null,null,"2009-09-29"]
[null,null,null,null,null,null,null,null,null,null,null,null,null,null,null,null,null,null,null,null,null,null,null,null,null,null,null,null,null,null,null,null,null,null,null,null,null,null,null,null,null,null,null,null,null,null,null,null,null,null,null,null,null,null,null,null,null,null,null,null,null,null,"2009-09-30"]
[null,null,null,null,null,null,null,null,null,null,null,null,null,null,null,null,null,null,null,null,null,null,null,null,null,null,null,null,null,null,null,null,null,null,null,null,null,null,null,null,null,null,null,null,null,null,null,null,null,null,null,null,null,null,null,null,null,null,null,null,null,null,"2009-10-01"]
[null,null,null,null,null,null,null,null,null,null,null,null,null,null,null,null,null,null,null,null,null,null,null,null,null,null,null,null,null,null,null,null,null,null,null,null,null,null,null,null,null,null,null,null,null,null,null,null,null,null,null,null,null,null,null,null,null,null,null,null,null,null,"2009-10-02"]
[null,null,null,null,null,null,null,null,null,null,null,null,null,null,null,null,null,null,null,null,null,null,null,null,null,null,null,null,null,null,null,null,null,null,null,null,null,null,null,null,null,null,null,null,null,null,null,null,null,null,null,null,null,null,null,null,null,null,null,null,null,null,"2009-10-03"]
[null,null,null,null,null,null,null,null,null,null,null,null,null,null,null,null,null,null,null,null,null,null,null,null,null,null,null,null,null,null,null,null,null,null,null,null,null,null,null,null,null,null,null,null,null,null,null,null,null,null,null,null,null,null,null,null,null,null,null,null,null,null,"2009-10-04"]
[null,null,null,null,null,null,null,null,null,null,null,null,null,null,null,null,null,null,null,null,null,null,null,null,null,null,null,null,null,null,null,null,null,null,null,null,null,null,null,null,null,null,null,null,null,null,null,null,null,null,null,null,null,null,null,null,null,null,null,null,null,null,"2009-10-05"]
[null,null,null,null,null,null,null,null,null,null,null,null,null,null,null,null,null,null,null,null,null,null,null,null,null,null,null,null,null,null,null,null,null,null,null,null,null,null,null,null,null,null,null,null,null,null,null,null,null,null,null,null,null,null,null,null,null,null,null,null,null,null,"2009-10-06"]
[null,null,null,null,null,null,null,null,null,null,null,null,null,null,null,null,null,null,null,null,null,null,null,null,null,null,null,null,null,null,null,null,null,null,null,null,null,null,null,null,null,null,null,null,null,null,null,null,null,null,null,null,null,null,null,null,null,null,null,null,null,null,"2009-10-07"]
[null,null,null,null,null,null,null,null,null,null,null,null,null,null,null,null,null,null,null,null,null,null,null,null,null,null,null,null,null,null,null,null,null,null,null,null,null,null,null,null,null,null,null,null,null,null,null,null,null,null,null,null,null,null,null,null,null,null,null,null,null,null,"2009-10-08"]
[null,null,null,null,null,null,null,null,null,null,null,null,null,null,null,null,null,null,null,null,null,null,null,null,null,null,null,null,null,null,null,null,null,null,null,null,null,null,null,null,null,null,null,null,null,null,null,null,null,null,null,null,null,null,null,null,null,null,null,null,null,null,"2009-10-09"]
[null,null,null,null,null,null,null,null,null,null,null,null,null,null,null,null,null,null,null,null,null,null,null,null,null,null,null,null,null,null,null,null,null,null,null,null,null,null,null,null,null,null,null,null,null,null,null,null,null,null,null,null,null,null,null,null,null,null,null,null,null,null,"2009-10-10"]
[null,null,null,null,null,null,null,null,null,null,null,null,null,null,null,null,null,null,null,null,null,null,null,null,null,null,null,null,null,null,null,null,null,null,null,null,null,null,null,null,null,null,null,null,null,null,null,null,null,null,null,null,null,null,null,null,null,null,null,null,null,null,"2009-10-11"]
[null,null,null,null,null,null,null,null,null,null,null,null,null,null,null,null,null,null,null,null,null,null,null,null,null,null,null,null,null,null,null,null,null,null,null,null,null,null,null,null,null,null,null,null,null,null,null,null,null,null,null,null,null,null,null,null,null,null,null,null,null,null,"2009-10-12"]
[null,null,null,null,null,null,null,null,null,null,null,null,null,null,null,null,null,null,null,null,null,null,null,null,null,null,null,null,null,null,null,null,null,null,null,null,null,null,null,null,null,null,null,null,null,null,null,null,null,null,null,null,null,null,null,null,null,null,null,null,null,null,"2009-10-13"]
[null,null,null,null,null,null,null,null,null,null,null,null,null,null,null,null,null,null,null,null,null,null,null,null,null,null,null,null,null,null,null,null,null,null,null,null,null,null,null,null,null,null,null,null,null,null,null,null,null,null,null,null,null,null,null,null,null,null,null,null,null,null,"2009-10-14"]
[null,null,null,null,null,null,null,null,null,null,null,null,null,null,null,null,null,null,null,null,null,null,null,null,null,null,null,null,null,null,null,null,null,null,null,null,null,null,null,null,null,null,null,null,null,null,null,null,null,null,null,null,null,null,null,null,null,null,null,null,null,null,"2009-10-15"]
[null,null,null,null,null,null,null,null,null,null,null,null,null,null,null,null,null,null,null,null,null,null,null,null,null,null,null,null,null,null,null,null,null,null,null,null,null,null,null,null,null,null,null,null,null,null,null,null,null,null,null,null,null,null,null,null,null,null,null,null,null,null,"2009-10-16"]
[null,null,null,null,null,null,null,null,null,null,null,null,null,null,null,null,null,null,null,null,null,null,null,null,null,null,null,null,null,null,null,null,null,null,null,null,null,null,null,null,null,null,null,null,null,null,null,null,null,null,null,null,null,null,null,null,null,null,null,null,null,null,"2009-10-17"]
[null,null,null,null,null,null,null,null,null,null,null,null,null,null,null,null,null,null,null,null,null,null,null,null,null,null,null,null,null,null,null,null,null,null,null,null,null,null,null,null,null,null,null,null,null,null,null,null,null,null,null,null,null,null,null,null,null,null,null,null,null,null,"2009-10-18"]
[null,null,null,null,null,null,null,null,null,null,null,null,null,null,null,null,null,null,null,null,null,null,null,null,null,null,null,null,null,null,null,null,null,null,null,null,null,null,null,null,null,null,null,null,null,null,null,null,null,null,null,null,null,null,null,null,null,null,null,null,null,null,"2009-10-19"]
[null,null,null,null,null,null,null,null,null,null,null,null,null,null,null,null,null,null,null,null,null,null,null,null,null,null,null,null,null,null,null,null,null,null,null,null,null,null,null,null,null,null,null,null,null,null,null,null,null,null,null,null,null,null,null,null,null,null,null,null,null,null,"2009-10-20"]
[null,null,null,null,null,null,null,null,null,null,null,null,null,null,null,null,null,null,null,null,null,null,null,null,null,null,null,null,null,null,null,null,null,null,null,null,null,null,null,null,null,null,null,null,null,null,null,null,null,null,null,null,null,null,null,null,null,null,null,null,null,null,"2009-10-21"]
[null,null,null,null,null,null,null,null,null,null,null,null,null,null,null,null,null,null,null,null,null,null,null,null,null,null,null,null,null,null,null,null,null,null,null,null,null,null,null,null,null,null,null,null,null,null,null,null,null,null,null,null,null,null,null,null,null,null,null,null,null,null,"2009-10-22"]
[null,null,null,null,null,null,null,null,null,null,null,null,null,null,null,null,null,null,null,null,null,null,null,null,null,null,null,null,null,null,null,null,null,null,null,null,null,null,null,null,null,null,null,null,null,null,null,null,null,null,null,null,null,null,null,null,null,null,null,null,null,null,"2009-10-23"]
[null,null,null,null,null,null,null,null,null,null,null,null,null,null,null,null,null,null,null,null,null,null,null,null,null,null,null,null,null,null,null,null,null,null,null,null,null,null,null,null,null,null,null,null,null,null,null,null,null,null,null,null,null,null,null,null,null,null,null,null,null,null,"2009-10-24"]
[null,null,null,null,null,null,null,null,null,null,null,null,null,null,null,null,null,null,null,null,null,null,null,null,null,null,null,null,null,null,null,null,null,null,null,null,null,null,null,null,null,null,null,null,null,null,null,null,null,null,null,null,null,null,null,null,null,null,null,null,null,null,"2009-10-25"]
[null,null,null,null,null,null,null,null,null,null,null,null,null,null,null,null,null,null,null,null,null,null,null,null,null,null,null,null,null,null,null,null,null,null,null,null,null,null,null,null,null,null,null,null,null,null,null,null,null,null,null,null,null,null,null,null,null,null,null,null,null,null,"2009-10-26"]
[null,null,null,null,null,null,null,null,null,null,null,null,null,null,null,null,null,null,null,null,null,null,null,null,null,null,null,null,null,null,null,null,null,null,null,null,null,null,null,null,null,null,null,null,null,null,null,null,null,null,null,null,null,null,null,null,null,null,null,null,null,null,"2009-10-27"]
[null,null,null,null,null,null,null,null,null,null,null,null,null,null,null,null,null,null,null,null,null,null,null,null,null,null,null,null,null,null,null,null,null,null,null,null,null,null,null,null,null,null,null,null,null,null,null,null,null,null,null,null,null,null,null,null,null,null,null,null,null,null,"2009-10-28"]
[null,null,null,null,null,null,null,null,null,null,null,null,null,null,null,null,null,null,null,null,null,null,null,null,null,null,null,null,null,null,null,null,null,null,null,null,null,null,null,null,null,null,null,null,null,null,null,null,null,null,null,null,null,null,null,null,null,null,null,null,null,null,"2009-10-29"]
[null,null,null,null,null,null,null,null,null,null,null,null,null,null,null,null,null,null,null,null,null,null,null,null,null,null,null,null,null,null,null,null,null,null,null,null,null,null,null,null,null,null,null,null,null,null,null,null,null,null,null,null,null,null,null,null,null,null,null,null,null,null,"2009-10-30"]
[null,null,null,null,null,null,null,null,null,null,null,null,null,null,null,null,null,null,null,null,null,null,null,null,null,null,null,null,null,null,null,null,null,null,null,null,null,null,null,null,null,null,null,null,null,null,null,null,null,null,null,null,null,null,null,null,null,null,null,null,null,null,"2009-10-31"]
[null,null,null,null,null,null,null,null,null,null,null,null,null,null,null,null,null,null,null,null,null,null,null,null,null,null,null,null,null,null,null,null,null,null,null,null,null,null,null,null,null,null,null,null,null,null,null,null,null,null,null,null,null,null,null,null,null,null,null,null,null,null,"2009-11-01"]
[null,null,null,null,null,null,null,null,null,null,null,null,null,null,null,null,null,null,null,null,null,null,null,null,null,null,null,null,null,null,null,null,null,null,null,null,null,null,null,null,null,null,null,null,null,null,null,null,null,null,null,null,null,null,null,null,null,null,null,null,null,null,"2009-11-02"]
[null,null,null,null,null,null,null,null,null,null,null,null,null,null,null,null,null,null,null,null,null,null,null,null,null,null,null,null,null,null,null,null,null,null,null,null,null,null,null,null,null,null,null,null,null,null,null,null,null,null,null,null,null,null,null,null,null,null,null,null,null,null,"2009-11-03"]
[null,null,null,null,null,null,null,null,null,null,null,null,null,null,null,null,null,null,null,null,null,null,null,null,null,null,null,null,null,null,null,null,null,null,null,null,null,null,null,null,null,null,null,null,null,null,null,null,null,null,null,null,null,null,null,null,null,null,null,null,null,null,"2009-11-04"]
[null,null,null,null,null,null,null,null,null,null,null,null,null,null,null,null,null,null,null,null,null,null,null,null,null,null,null,null,null,null,null,null,null,null,null,null,null,null,null,null,null,null,null,null,null,null,null,null,null,null,null,null,null,null,null,null,null,null,null,null,null,null,"2009-11-05"]
[null,null,null,null,null,null,null,null,null,null,null,null,null,null,null,null,null,null,null,null,null,null,null,null,null,null,null,null,null,null,null,null,null,null,null,null,null,null,null,null,null,null,null,null,null,null,null,null,null,null,null,null,null,null,null,null,null,null,null,null,null,null,"2009-11-06"]
[null,null,null,null,null,null,null,null,null,null,null,null,null,null,null,null,null,null,null,null,null,null,null,null,null,null,null,null,null,null,null,null,null,null,null,null,null,null,null,null,null,null,null,null,null,null,null,null,null,null,null,null,null,null,null,null,null,null,null,null,null,null,"2009-11-07"]
[null,null,null,null,null,null,null,null,null,null,null,null,null,null,null,null,null,null,null,null,null,null,null,null,null,null,null,null,null,null,null,null,null,null,null,null,null,null,null,null,null,null,null,null,null,null,null,null,null,null,null,null,null,null,null,null,null,null,null,null,null,null,"2009-11-08"]
[null,null,null,null,null,null,null,null,null,null,null,null,null,null,null,null,null,null,null,null,null,null,null,null,null,null,null,null,null,null,null,null,null,null,null,null,null,null,null,null,null,null,null,null,null,null,null,null,null,null,null,null,null,null,null,null,null,null,null,null,null,null,"2009-11-09"]
[null,null,null,null,null,null,null,null,null,null,null,null,null,null,null,null,null,null,null,null,null,null,null,null,null,null,null,null,null,null,null,null,null,null,null,null,null,null,null,null,null,null,null,null,null,null,null,null,null,null,null,null,null,null,null,null,null,null,null,null,null,null,"2009-11-10"]
[null,null,null,null,null,null,null,null,null,null,null,null,null,null,null,null,null,null,null,null,null,null,null,null,null,null,null,null,null,null,null,null,null,null,null,null,null,null,null,null,null,null,null,null,null,null,null,null,null,null,null,null,null,null,null,null,null,null,null,null,null,null,"2009-11-11"]
[null,null,null,null,null,null,null,null,null,null,null,null,null,null,null,null,null,null,null,null,null,null,null,null,null,null,null,null,null,null,null,null,null,null,null,null,null,null,null,null,null,null,null,null,null,null,null,null,null,null,null,null,null,null,null,null,null,null,null,null,null,null,"2009-11-12"]
[null,null,null,null,null,null,null,null,null,null,null,null,null,null,null,null,null,null,null,null,null,null,null,null,null,null,null,null,null,null,null,null,null,null,null,null,null,null,null,null,null,null,null,null,null,null,null,null,null,null,null,null,null,null,null,null,null,null,null,null,null,null,"2009-11-13"]
[null,null,null,null,null,null,null,null,null,null,null,null,null,null,null,null,null,null,null,null,null,null,null,null,null,null,null,null,null,null,null,null,null,null,null,null,null,null,null,null,null,null,null,null,null,null,null,null,null,null,null,null,null,null,null,null,null,null,null,null,null,null,"2009-11-14"]
[null,null,null,null,null,null,null,null,null,null,null,null,null,null,null,null,null,null,null,null,null,null,null,null,null,null,null,null,null,null,null,null,null,null,null,null,null,null,null,null,null,null,null,null,null,null,null,null,null,null,null,null,null,null,null,null,null,null,null,null,null,null,"2009-11-15"]
[null,null,null,null,null,null,null,null,null,null,null,null,null,null,null,null,null,null,null,null,null,null,null,null,null,null,null,null,null,null,null,null,null,null,null,null,null,null,null,null,null,null,null,null,null,null,null,null,null,null,null,null,null,null,null,null,null,null,null,null,null,null,"2009-11-16"]
[null,null,null,null,null,null,null,null,null,null,null,null,null,null,null,null,null,null,null,null,null,null,null,null,null,null,null,null,null,null,null,null,null,null,null,null,null,null,null,null,null,null,null,null,null,null,null,null,null,null,null,null,null,null,null,null,null,null,null,null,null,null,"2009-11-17"]
[null,null,null,null,null,null,null,null,null,null,null,null,null,null,null,null,null,null,null,null,null,null,null,null,null,null,null,null,null,null,null,null,null,null,null,null,null,null,null,null,null,null,null,null,null,null,null,null,null,null,null,null,null,null,null,null,null,null,null,null,null,null,"2009-11-18"]
[null,null,null,null,null,null,null,null,null,null,null,null,null,null,null,null,null,null,null,null,null,null,null,null,null,null,null,null,null,null,null,null,null,null,null,null,null,null,null,null,null,null,null,null,null,null,null,null,null,null,null,null,null,null,null,null,null,null,null,null,null,null,"2009-11-19"]
[null,null,null,null,null,null,null,null,null,null,null,null,null,null,null,null,null,null,null,null,null,null,null,null,null,null,null,null,null,null,null,null,null,null,null,null,null,null,null,null,null,null,null,null,null,null,null,null,null,null,null,null,null,null,null,null,null,null,null,null,null,null,"2009-11-20"]
[null,null,null,null,null,null,null,null,null,null,null,null,null,null,null,null,null,null,null,null,null,null,null,null,null,null,null,null,null,null,null,null,null,null,null,null,null,null,null,null,null,null,null,null,null,null,null,null,null,null,null,null,null,null,null,null,null,null,null,null,null,null,"2009-11-21"]
[null,null,null,null,null,null,null,null,null,null,null,null,null,null,null,null,null,null,null,null,null,null,null,null,null,null,null,null,null,null,null,null,null,null,null,null,null,null,null,null,null,null,null,null,null,null,null,null,null,null,null,null,null,null,null,null,null,null,null,null,null,null,"2009-11-22"]
[null,null,null,null,null,null,null,null,null,null,null,null,null,null,null,null,null,null,null,null,null,null,null,null,null,null,null,null,null,null,null,null,null,null,null,null,null,null,null,null,null,null,null,null,null,null,null,null,null,null,null,null,null,null,null,null,null,null,null,null,null,null,"2009-11-23"]
[null,null,null,null,null,null,null,null,null,null,null,null,null,null,null,null,null,null,null,null,null,null,null,null,null,null,null,null,null,null,null,null,null,null,null,null,null,null,null,null,null,null,null,null,null,null,null,null,null,null,null,null,null,null,null,null,null,null,null,null,null,null,"2009-11-24"]
[null,null,null,null,null,null,null,null,null,null,null,null,null,null,null,null,null,null,null,null,null,null,null,null,null,null,null,null,null,null,null,null,null,null,null,null,null,null,null,null,null,null,null,null,null,null,null,null,null,null,null,null,null,null,null,null,null,null,null,null,null,null,"2009-11-25"]
[null,null,null,null,null,null,null,null,null,null,null,null,null,null,null,null,null,null,null,null,null,null,null,null,null,null,null,null,null,null,null,null,null,null,null,null,null,null,null,null,null,null,null,null,null,null,null,null,null,null,null,null,null,null,null,null,null,null,null,null,null,null,"2009-11-26"]
[null,null,null,null,null,null,null,null,null,null,null,null,null,null,null,null,null,null,null,null,null,null,null,null,null,null,null,null,null,null,null,null,null,null,null,null,null,null,null,null,null,null,null,null,null,null,null,null,null,null,null,null,null,null,null,null,null,null,null,null,null,null,"2009-11-27"]
[null,null,null,null,null,null,null,null,null,null,null,null,null,null,null,null,null,null,null,null,null,null,null,null,null,null,null,null,null,null,null,null,null,null,null,null,null,null,null,null,null,null,null,null,null,null,null,null,null,null,null,null,null,null,null,null,null,null,null,null,null,null,"2009-11-28"]
[null,null,null,null,null,null,null,null,null,null,null,null,null,null,null,null,null,null,null,null,null,null,null,null,null,null,null,null,null,null,null,null,null,null,null,null,null,null,null,null,null,null,null,null,null,null,null,null,null,null,null,null,null,null,null,null,null,null,null,null,null,null,"2009-11-29"]
[null,null,null,null,null,null,null,null,null,null,null,null,null,null,null,null,null,null,null,null,null,null,null,null,null,null,null,null,null,null,null,null,null,null,null,null,null,null,null,null,null,null,null,null,null,null,null,null,null,null,null,null,null,null,null,null,null,null,null,null,null,null,"2009-11-30"]
[null,null,null,null,null,null,null,null,null,null,null,null,null,null,null,null,null,null,null,null,null,null,null,null,null,null,null,null,null,null,null,null,null,null,null,null,null,null,null,null,null,null,null,null,null,null,null,null,null,null,null,null,null,null,null,null,null,null,null,null,null,null,"2009-12-01"]
[null,null,null,null,null,null,null,null,null,null,null,null,null,null,null,null,null,null,null,null,null,null,null,null,null,null,null,null,null,null,null,null,null,null,null,null,null,null,null,null,null,null,null,null,null,null,null,null,null,null,null,null,null,null,null,null,null,null,null,null,null,null,"2009-12-02"]
[null,null,null,null,null,null,null,null,null,null,null,null,null,null,null,null,null,null,null,null,null,null,null,null,null,null,null,null,null,null,null,null,null,null,null,null,null,null,null,null,null,null,null,null,null,null,null,null,null,null,null,null,null,null,null,null,null,null,null,null,null,null,"2009-12-03"]
[null,null,null,null,null,null,null,null,null,null,null,null,null,null,null,null,null,null,null,null,null,null,null,null,null,null,null,null,null,null,null,null,null,null,null,null,null,null,null,null,null,null,null,null,null,null,null,null,null,null,null,null,null,null,null,null,null,null,null,null,null,null,"2009-12-04"]
[null,null,null,null,null,null,null,null,null,null,null,null,null,null,null,null,null,null,null,null,null,null,null,null,null,null,null,null,null,null,null,null,null,null,null,null,null,null,null,null,null,null,null,null,null,null,null,null,null,null,null,null,null,null,null,null,null,null,null,null,null,null,"2009-12-05"]
[null,null,null,null,null,null,null,null,null,null,null,null,null,null,null,null,null,null,null,null,null,null,null,null,null,null,null,null,null,null,null,null,null,null,null,null,null,null,null,null,null,null,null,null,null,null,null,null,null,null,null,null,null,null,null,null,null,null,null,null,null,null,"2009-12-06"]
[null,null,null,null,null,null,null,null,null,null,null,null,null,null,null,null,null,null,null,null,null,null,null,null,null,null,null,null,null,null,null,null,null,null,null,null,null,null,null,null,null,null,null,null,null,null,null,null,null,null,null,null,null,null,null,null,null,null,null,null,null,null,"2009-12-07"]
[null,null,null,null,null,null,null,null,null,null,null,null,null,null,null,null,null,null,null,null,null,null,null,null,null,null,null,null,null,null,null,null,null,null,null,null,null,null,null,null,null,null,null,null,null,null,null,null,null,null,null,null,null,null,null,null,null,null,null,null,null,null,"2009-12-08"]
[null,null,null,null,null,null,null,null,null,null,null,null,null,null,null,null,null,null,null,null,null,null,null,null,null,null,null,null,null,null,null,null,null,null,null,null,null,null,null,null,null,null,null,null,null,null,null,null,null,null,null,null,null,null,null,null,null,null,null,null,null,null,"2009-12-09"]
[null,null,null,null,null,null,null,null,null,null,null,null,null,null,null,null,null,null,null,null,null,null,null,null,null,null,null,null,null,null,null,null,null,null,null,null,null,null,null,null,null,null,null,null,null,null,null,null,null,null,null,null,null,null,null,null,null,null,null,null,null,null,"2009-12-10"]
[null,null,null,null,null,null,null,null,null,null,null,null,null,null,null,null,null,null,null,null,null,null,null,null,null,null,null,null,null,null,null,null,null,null,null,null,null,null,null,null,null,null,null,null,null,null,null,null,null,null,null,null,null,null,null,null,null,null,null,null,null,null,"2009-12-11"]
[null,null,null,null,null,null,null,null,null,null,null,null,null,null,null,null,null,null,null,null,null,null,null,null,null,null,null,null,null,null,null,null,null,null,null,null,null,null,null,null,null,null,null,null,null,null,null,null,null,null,null,null,null,null,null,null,null,null,null,null,null,null,"2009-12-12"]
[null,null,null,null,null,null,null,null,null,null,null,null,null,null,null,null,null,null,null,null,null,null,null,null,null,null,null,null,null,null,null,null,null,null,null,null,null,null,null,null,null,null,null,null,null,null,null,null,null,null,null,null,null,null,null,null,null,null,null,null,null,null,"2009-12-13"]
[null,null,null,null,null,null,null,null,null,null,null,null,null,null,null,null,null,null,null,null,null,null,null,null,null,null,null,null,null,null,null,null,null,null,null,null,null,null,null,null,null,null,null,null,null,null,null,null,null,null,null,null,null,null,null,null,null,null,null,null,null,null,"2009-12-14"]
[null,null,null,null,null,null,null,null,null,null,null,null,null,null,null,null,null,null,null,null,null,null,null,null,null,null,null,null,null,null,null,null,null,null,null,null,null,null,null,null,null,null,null,null,null,null,null,null,null,null,null,null,null,null,null,null,null,null,null,null,null,null,"2009-12-15"]
[null,null,null,null,null,null,null,null,null,null,null,null,null,null,null,null,null,null,null,null,null,null,null,null,null,null,null,null,null,null,null,null,null,null,null,null,null,null,null,null,null,null,null,null,null,null,null,null,null,null,null,null,null,null,null,null,null,null,null,null,null,null,"2009-12-16"]
[null,null,null,null,null,null,null,null,null,null,null,null,null,null,null,null,null,null,null,null,null,null,null,null,null,null,null,null,null,null,null,null,null,null,null,null,null,null,null,null,null,null,null,null,null,null,null,null,null,null,null,null,null,null,null,null,null,null,null,null,null,null,"2009-12-17"]
[null,null,null,null,null,null,null,null,null,null,null,null,null,null,null,null,null,null,null,null,null,null,null,null,null,null,null,null,null,null,null,null,null,null,null,null,null,null,null,null,null,null,null,null,null,null,null,null,null,null,null,null,null,null,null,null,null,null,null,null,null,null,"2009-12-18"]
[null,null,null,null,null,null,null,null,null,null,null,null,null,null,null,null,null,null,null,null,null,null,null,null,null,null,null,null,null,null,null,null,null,null,null,null,null,null,null,null,null,null,null,null,null,null,null,null,null,null,null,null,null,null,null,null,null,null,null,null,null,null,"2009-12-19"]
[null,null,null,null,null,null,null,null,null,null,null,null,null,null,null,null,null,null,null,null,null,null,null,null,null,null,null,null,null,null,null,null,null,null,null,null,null,null,null,null,null,null,null,null,null,null,null,null,null,null,null,null,null,null,null,null,null,null,null,null,null,null,"2009-12-20"]
[null,null,null,null,null,null,null,null,null,null,null,null,null,null,null,null,null,null,null,null,null,null,null,null,null,null,null,null,null,null,null,null,null,null,null,null,null,null,null,null,null,null,null,null,null,null,null,null,null,null,null,null,null,null,null,null,null,null,null,null,null,null,"2009-12-21"]
[null,null,null,null,null,null,null,null,null,null,null,null,null,null,null,null,null,null,null,null,null,null,null,null,null,null,null,null,null,null,null,null,null,null,null,null,null,null,null,null,null,null,null,null,null,null,null,null,null,null,null,null,null,null,null,null,null,null,null,null,null,null,"2009-12-22"]
[null,null,null,null,null,null,null,null,null,null,null,null,null,null,null,null,null,null,null,null,null,null,null,null,null,null,null,null,null,null,null,null,null,null,null,null,null,null,null,null,null,null,null,null,null,null,null,null,null,null,null,null,null,null,null,null,null,null,null,null,null,null,"2009-12-23"]
[null,null,null,null,null,null,null,null,null,null,null,null,null,null,null,null,null,null,null,null,null,null,null,null,null,null,null,null,null,null,null,null,null,null,null,null,null,null,null,null,null,null,null,null,null,null,null,null,null,null,null,null,null,null,null,null,null,null,null,null,null,null,"2009-12-24"]
[null,null,null,null,null,null,null,null,null,null,null,null,null,null,null,null,null,null,null,null,null,null,null,null,null,null,null,null,null,null,null,null,null,null,null,null,null,null,null,null,null,null,null,null,null,null,null,null,null,null,null,null,null,null,null,null,null,null,null,null,null,null,"2009-12-25"]
[null,null,null,null,null,null,null,null,null,null,null,null,null,null,null,null,null,null,null,null,null,null,null,null,null,null,null,null,null,null,null,null,null,null,null,null,null,null,null,null,null,null,null,null,null,null,null,null,null,null,null,null,null,null,null,null,null,null,null,null,null,null,"2009-12-26"]
[null,null,null,null,null,null,null,null,null,null,null,null,null,null,null,null,null,null,null,null,null,null,null,null,null,null,null,null,null,null,null,null,null,null,null,null,null,null,null,null,null,null,null,null,null,null,null,null,null,null,null,null,null,null,null,null,null,null,null,null,null,null,"2009-12-27"]
[null,null,null,null,null,null,null,null,null,null,null,null,null,null,null,null,null,null,null,null,null,null,null,null,null,null,null,null,null,null,null,null,null,null,null,null,null,null,null,null,null,null,null,null,null,null,null,null,null,null,null,null,null,null,null,null,null,null,null,null,null,null,"2009-12-28"]
[null,null,null,null,null,null,null,null,null,null,null,null,null,null,null,null,null,null,null,null,null,null,null,null,null,null,null,null,null,null,null,null,null,null,null,null,null,null,null,null,null,null,null,null,null,null,null,null,null,null,null,null,null,null,null,null,null,null,null,null,null,null,"2009-12-29"]
[null,null,null,null,null,null,null,null,null,null,null,null,null,null,null,null,null,null,null,null,null,null,null,null,null,null,null,null,null,null,null,null,null,null,null,null,null,null,null,null,null,null,null,null,null,null,null,null,null,null,null,null,null,null,null,null,null,null,null,null,null,null,"2009-12-30"]
[null,null,null,null,null,null,null,null,null,null,null,null,null,null,null,null,null,null,null,null,null,null,null,null,null,null,null,null,null,null,null,null,null,null,null,null,null,null,null,null,null,null,null,null,null,null,null,null,null,null,null,null,null,null,null,null,null,null,null,null,null,null,"2009-12-31"]
[null,null,null,null,null,null,null,null,null,null,null,null,null,null,null,null,null,null,null,null,null,null,null,null,null,null,null,null,null,null,null,null,null,null,null,null,null,null,null,null,null,null,null,null,null,null,null,null,null,null,null,null,null,null,null,null,null,null,null,null,null,null,"2010-01-01"]
[null,null,null,null,null,null,null,null,null,null,null,null,null,null,null,null,null,null,null,null,null,null,null,null,null,null,null,null,null,null,null,null,null,null,null,null,null,null,null,null,null,null,null,null,null,null,null,null,null,null,null,null,null,null,null,null,null,null,null,null,null,null,"2010-01-02"]
[null,null,null,null,null,null,null,null,null,null,null,null,null,null,null,null,null,null,null,null,null,null,null,null,null,null,null,null,null,null,null,null,null,null,null,null,null,null,null,null,null,null,null,null,null,null,null,null,null,null,null,null,null,null,null,null,null,null,null,null,null,null,"2010-01-03"]
[null,null,null,null,null,null,null,null,null,null,null,null,null,null,null,null,null,null,null,null,null,null,null,null,null,null,null,null,null,null,null,null,null,null,null,null,null,null,null,null,null,null,null,null,null,null,null,null,null,null,null,null,null,null,null,null,null,null,null,null,null,null,"2010-01-04"]
[null,null,null,null,null,null,null,null,null,null,null,null,null,null,null,null,null,null,null,null,null,null,null,null,null,null,null,null,null,null,null,null,null,null,null,null,null,null,null,null,null,null,null,null,null,null,null,null,null,null,null,null,null,null,null,null,null,null,null,null,null,null,"2010-01-05"]
[null,null,null,null,null,null,null,null,null,null,null,null,null,null,null,null,null,null,null,null,null,null,null,null,null,null,null,null,null,null,null,null,null,null,null,null,null,null,null,null,null,null,null,null,null,null,null,null,null,null,null,null,null,null,null,null,null,null,null,null,null,null,"2010-01-06"]
[null,null,null,null,null,null,null,null,null,null,null,null,null,null,null,null,null,null,null,null,null,null,null,null,null,null,null,null,null,null,null,null,null,null,null,null,null,null,null,null,null,null,null,null,null,null,null,null,null,null,null,null,null,null,null,null,null,null,null,null,null,null,"2010-01-07"]
[null,null,null,null,null,null,null,null,null,null,null,null,null,null,null,null,null,null,null,null,null,null,null,null,null,null,null,null,null,null,null,null,null,null,null,null,null,null,null,null,null,null,null,null,null,null,null,null,null,null,null,null,null,null,null,null,null,null,null,null,null,null,"2010-01-08"]
[null,null,null,null,null,null,null,null,null,null,null,null,null,null,null,null,null,null,null,null,null,null,null,null,null,null,null,null,null,null,null,null,null,null,null,null,null,null,null,null,null,null,null,null,null,null,null,null,null,null,null,null,null,null,null,null,null,null,null,null,null,null,"2010-01-09"]
[null,null,null,null,null,null,null,null,null,null,null,null,null,null,null,null,null,null,null,null,null,null,null,null,null,null,null,null,null,null,null,null,null,null,null,null,null,null,null,null,null,null,null,null,null,null,null,null,null,null,null,null,null,null,null,null,null,null,null,null,null,null,"2010-01-10"]
[null,null,null,null,null,null,null,null,null,null,null,null,null,null,null,null,null,null,null,null,null,null,null,null,null,null,null,null,null,null,null,null,null,null,null,null,null,null,null,null,null,null,null,null,null,null,null,null,null,null,null,null,null,null,null,null,null,null,null,null,null,null,"2010-01-11"]
[null,null,null,null,null,null,null,null,null,null,null,null,null,null,null,null,null,null,null,null,null,null,null,null,null,null,null,null,null,null,null,null,null,null,null,null,null,null,null,null,null,null,null,null,null,null,null,null,null,null,null,null,null,null,null,null,null,null,null,null,null,null,"2010-01-12"]
[null,null,null,null,null,null,null,null,null,null,null,null,null,null,null,null,null,null,null,null,null,null,null,null,null,null,null,null,null,null,null,null,null,null,null,null,null,null,null,null,null,null,null,null,null,null,null,null,null,null,null,null,null,null,null,null,null,null,null,null,null,null,"2010-01-13"]
[null,null,null,null,null,null,null,null,null,null,null,null,null,null,null,null,null,null,null,null,null,null,null,null,null,null,null,null,null,null,null,null,null,null,null,null,null,null,null,null,null,null,null,null,null,null,null,null,null,null,null,null,null,null,null,null,null,null,null,null,null,null,"2010-01-14"]
[null,null,null,null,null,null,null,null,null,null,null,null,null,null,null,null,null,null,null,null,null,null,null,null,null,null,null,null,null,null,null,null,null,null,null,null,null,null,null,null,null,null,null,null,null,null,null,null,null,null,null,null,null,null,null,null,null,null,null,null,null,null,"2010-01-15"]
[null,null,null,null,null,null,null,null,null,null,null,null,null,null,null,null,null,null,null,null,null,null,null,null,null,null,null,null,null,null,null,null,null,null,null,null,null,null,null,null,null,null,null,null,null,null,null,null,null,null,null,null,null,null,null,null,null,null,null,null,null,null,"2010-01-16"]
[null,null,null,null,null,null,null,null,null,null,null,null,null,null,null,null,null,null,null,null,null,null,null,null,null,null,null,null,null,null,null,null,null,null,null,null,null,null,null,null,null,null,null,null,null,null,null,null,null,null,null,null,null,null,null,null,null,null,null,null,null,null,"2010-01-17"]
[null,null,null,null,null,null,null,null,null,null,null,null,null,null,null,null,null,null,null,null,null,null,null,null,null,null,null,null,null,null,null,null,null,null,null,null,null,null,null,null,null,null,null,null,null,null,null,null,null,null,null,null,null,null,null,null,null,null,null,null,null,null,"2010-01-18"]
[null,null,null,null,null,null,null,null,null,null,null,null,null,null,null,null,null,null,null,null,null,null,null,null,null,null,null,null,null,null,null,null,null,null,null,null,null,null,null,null,null,null,null,null,null,null,null,null,null,null,null,null,null,null,null,null,null,null,null,null,null,null,"2010-01-19"]
[null,null,null,null,null,null,null,null,null,null,null,null,null,null,null,null,null,null,null,null,null,null,null,null,null,null,null,null,null,null,null,null,null,null,null,null,null,null,null,null,null,null,null,null,null,null,null,null,null,null,null,null,null,null,null,null,null,null,null,null,null,null,"2010-01-20"]
[null,null,null,null,null,null,null,null,null,null,null,null,null,null,null,null,null,null,null,null,null,null,null,null,null,null,null,null,null,null,null,null,null,null,null,null,null,null,null,null,null,null,null,null,null,null,null,null,null,null,null,null,null,null,null,null,null,null,null,null,null,null,"2010-01-21"]
[null,null,null,null,null,null,null,null,null,null,null,null,null,null,null,null,null,null,null,null,null,null,null,null,null,null,null,null,null,null,null,null,null,null,null,null,null,null,null,null,null,null,null,null,null,null,null,null,null,null,null,null,null,null,null,null,null,null,null,null,null,null,"2010-01-22"]
[null,null,null,null,null,null,null,null,null,null,null,null,null,null,null,null,null,null,null,null,null,null,null,null,null,null,null,null,null,null,null,null,null,null,null,null,null,null,null,null,null,null,null,null,null,null,null,null,null,null,null,null,null,null,null,null,null,null,null,null,null,null,"2010-01-23"]
[null,null,null,null,null,null,null,null,null,null,null,null,null,null,null,null,null,null,null,null,null,null,null,null,null,null,null,null,null,null,null,null,null,null,null,null,null,null,null,null,null,null,null,null,null,null,null,null,null,null,null,null,null,null,null,null,null,null,null,null,null,null,"2010-01-24"]
[null,null,null,null,null,null,null,null,null,null,null,null,null,null,null,null,null,null,null,null,null,null,null,null,null,null,null,null,null,null,null,null,null,null,null,null,null,null,null,null,null,null,null,null,null,null,null,null,null,null,null,null,null,null,null,null,null,null,null,null,null,null,"2010-01-25"]
[null,null,null,null,null,null,null,null,null,null,null,null,null,null,null,null,null,null,null,null,null,null,null,null,null,null,null,null,null,null,null,null,null,null,null,null,null,null,null,null,null,null,null,null,null,null,null,null,null,null,null,null,null,null,null,null,null,null,null,null,null,null,"2010-01-26"]
[null,null,null,null,null,null,null,null,null,null,null,null,null,null,null,null,null,null,null,null,null,null,null,null,null,null,null,null,null,null,null,null,null,null,null,null,null,null,null,null,null,null,null,null,null,null,null,null,null,null,null,null,null,null,null,null,null,null,null,null,null,null,"2010-01-27"]
[null,null,null,null,null,null,null,null,null,null,null,null,null,null,null,null,null,null,null,null,null,null,null,null,null,null,null,null,null,null,null,null,null,null,null,null,null,null,null,null,null,null,null,null,null,null,null,null,null,null,null,null,null,null,null,null,null,null,null,null,null,null,"2010-01-28"]
[null,null,null,null,null,null,null,null,null,null,null,null,null,null,null,null,null,null,null,null,null,null,null,null,null,null,null,null,null,null,null,null,null,null,null,null,null,null,null,null,null,null,null,null,null,null,null,null,null,null,null,null,null,null,null,null,null,null,null,null,null,null,"2010-01-29"]
[null,null,null,null,null,null,null,null,null,null,null,null,null,null,null,null,null,null,null,null,null,null,null,null,null,null,null,null,null,null,null,null,null,null,null,null,null,null,null,null,null,null,null,null,null,null,null,null,null,null,null,null,null,null,null,null,null,null,null,null,null,null,"2010-01-30"]
[null,null,null,null,null,null,null,null,null,null,null,null,null,null,null,null,null,null,null,null,null,null,null,null,null,null,null,null,null,null,null,null,null,null,null,null,null,null,null,null,null,null,null,null,null,null,null,null,null,null,null,null,null,null,null,null,null,null,null,null,null,null,"2010-01-31"]
[null,null,null,null,null,null,null,null,null,null,null,null,null,null,null,null,null,null,null,null,null,null,null,null,null,null,null,null,null,null,null,null,null,null,null,null,null,null,null,null,null,null,null,null,null,null,null,null,null,null,null,null,null,null,null,null,null,null,null,null,null,null,"2010-02-01"]
[null,null,null,null,null,null,null,null,null,null,null,null,null,null,null,null,null,null,null,null,null,null,null,null,null,null,null,null,null,null,null,null,null,null,null,null,null,null,null,null,null,null,null,null,null,null,null,null,null,null,null,null,null,null,null,null,null,null,null,null,null,null,"2010-02-02"]
[null,null,null,null,null,null,null,null,null,null,null,null,null,null,null,null,null,null,null,null,null,null,null,null,null,null,null,null,null,null,null,null,null,null,null,null,null,null,null,null,null,null,null,null,null,null,null,null,null,null,null,null,null,null,null,null,null,null,null,null,null,null,"2010-02-03"]
[null,null,null,null,null,null,null,null,null,null,null,null,null,null,null,null,null,null,null,null,null,null,null,null,null,null,null,null,null,null,null,null,null,null,null,null,null,null,null,null,null,null,null,null,null,null,null,null,null,null,null,null,null,null,null,null,null,null,null,null,null,null,"2010-02-04"]
[null,null,null,null,null,null,null,null,null,null,null,null,null,null,null,null,null,null,null,null,null,null,null,null,null,null,null,null,null,null,null,null,null,null,null,null,null,null,null,null,null,null,null,null,null,null,null,null,null,null,null,null,null,null,null,null,null,null,null,null,null,null,"2010-02-05"]
[null,null,null,null,null,null,null,null,null,null,null,null,null,null,null,null,null,null,null,null,null,null,null,null,null,null,null,null,null,null,null,null,null,null,null,null,null,null,null,null,null,null,null,null,null,null,null,null,null,null,null,null,null,null,null,null,null,null,null,null,null,null,"2010-02-06"]
[null,null,null,null,null,null,null,null,null,null,null,null,null,null,null,null,null,null,null,null,null,null,null,null,null,null,null,null,null,null,null,null,null,null,null,null,null,null,null,null,null,null,null,null,null,null,null,null,null,null,null,null,null,null,null,null,null,null,null,null,null,null,"2010-02-07"]
[null,null,null,null,null,null,null,null,null,null,null,null,null,null,null,null,null,null,null,null,null,null,null,null,null,null,null,null,null,null,null,null,null,null,null,null,null,null,null,null,null,null,null,null,null,null,null,null,null,null,null,null,null,null,null,null,null,null,null,null,null,null,"2010-02-08"]
[null,null,null,null,null,null,null,null,null,null,null,null,null,null,null,null,null,null,null,null,null,null,null,null,null,null,null,null,null,null,null,null,null,null,null,null,null,null,null,null,null,null,null,null,null,null,null,null,null,null,null,null,null,null,null,null,null,null,null,null,null,null,"2010-02-09"]
[null,null,null,null,null,null,null,null,null,null,null,null,null,null,null,null,null,null,null,null,null,null,null,null,null,null,null,null,null,null,null,null,null,null,null,null,null,null,null,null,null,null,null,null,null,null,null,null,null,null,null,null,null,null,null,null,null,null,null,null,null,null,"2010-02-10"]
[null,null,null,null,null,null,null,null,null,null,null,null,null,null,null,null,null,null,null,null,null,null,null,null,null,null,null,null,null,null,null,null,null,null,null,null,null,null,null,null,null,null,null,null,null,null,null,null,null,null,null,null,null,null,null,null,null,null,null,null,null,null,"2010-02-11"]
[null,null,null,null,null,null,null,null,null,null,null,null,null,null,null,null,null,null,null,null,null,null,null,null,null,null,null,null,null,null,null,null,null,null,null,null,null,null,null,null,null,null,null,null,null,null,null,null,null,null,null,null,null,null,null,null,null,null,null,null,null,null,"2010-02-12"]
[null,null,null,null,null,null,null,null,null,null,null,null,null,null,null,null,null,null,null,null,null,null,null,null,null,null,null,null,null,null,null,null,null,null,null,null,null,null,null,null,null,null,null,null,null,null,null,null,null,null,null,null,null,null,null,null,null,null,null,null,null,null,"2010-02-13"]
[null,null,null,null,null,null,null,null,null,null,null,null,null,null,null,null,null,null,null,null,null,null,null,null,null,null,null,null,null,null,null,null,null,null,null,null,null,null,null,null,null,null,null,null,null,null,null,null,null,null,null,null,null,null,null,null,null,null,null,null,null,null,"2010-02-14"]
[null,null,null,null,null,null,null,null,null,null,null,null,null,null,null,null,null,null,null,null,null,null,null,null,null,null,null,null,null,null,null,null,null,null,null,null,null,null,null,null,null,null,null,null,null,null,null,null,null,null,null,null,null,null,null,null,null,null,null,null,null,null,"2010-02-15"]
[null,null,null,null,null,null,null,null,null,null,null,null,null,null,null,null,null,null,null,null,null,null,null,null,null,null,null,null,null,null,null,null,null,null,null,null,null,null,null,null,null,null,null,null,null,null,null,null,null,null,null,null,null,null,null,null,null,null,null,null,null,null,"2010-02-16"]
[null,null,null,null,null,null,null,null,null,null,null,null,null,null,null,null,null,null,null,null,null,null,null,null,null,null,null,null,null,null,null,null,null,null,null,null,null,null,null,null,null,null,null,null,null,null,null,null,null,null,null,null,null,null,null,null,null,null,null,null,null,null,"2010-02-17"]
[null,null,null,null,null,null,null,null,null,null,null,null,null,null,null,null,null,null,null,null,null,null,null,null,null,null,null,null,null,null,null,null,null,null,null,null,null,null,null,null,null,null,null,null,null,null,null,null,null,null,null,null,null,null,null,null,null,null,null,null,null,null,"2010-02-18"]
[null,null,null,null,null,null,null,null,null,null,null,null,null,null,null,null,null,null,null,null,null,null,null,null,null,null,null,null,null,null,null,null,null,null,null,null,null,null,null,null,null,null,null,null,null,null,null,null,null,null,null,null,null,null,null,null,null,null,null,null,null,null,"2010-02-19"]
[null,null,null,null,null,null,null,null,null,null,null,null,null,null,null,null,null,null,null,null,null,null,null,null,null,null,null,null,null,null,null,null,null,null,null,null,null,null,null,null,null,null,null,null,null,null,null,null,null,null,null,null,null,null,null,null,null,null,null,null,null,null,"2010-02-20"]
[null,null,null,null,null,null,null,null,null,null,null,null,null,null,null,null,null,null,null,null,null,null,null,null,null,null,null,null,null,null,null,null,null,null,null,null,null,null,null,null,null,null,null,null,null,null,null,null,null,null,null,null,null,null,null,null,null,null,null,null,null,null,"2010-02-21"]
[null,null,null,null,null,null,null,null,null,null,null,null,null,null,null,null,null,null,null,null,null,null,null,null,null,null,null,null,null,null,null,null,null,null,null,null,null,null,null,null,null,null,null,null,null,null,null,null,null,null,null,null,null,null,null,null,null,null,null,null,null,null,"2010-02-22"]
[null,null,null,null,null,null,null,null,null,null,null,null,null,null,null,null,null,null,null,null,null,null,null,null,null,null,null,null,null,null,null,null,null,null,null,null,null,null,null,null,null,null,null,null,null,null,null,null,null,null,null,null,null,null,null,null,null,null,null,null,null,null,"2010-02-23"]
[null,null,null,null,null,null,null,null,null,null,null,null,null,null,null,null,null,null,null,null,null,null,null,null,null,null,null,null,null,null,null,null,null,null,null,null,null,null,null,null,null,null,null,null,null,null,null,null,null,null,null,null,null,null,null,null,null,null,null,null,null,null,"2010-02-24"]
[null,null,null,null,null,null,null,null,null,null,null,null,null,null,null,null,null,null,null,null,null,null,null,null,null,null,null,null,null,null,null,null,null,null,null,null,null,null,null,null,null,null,null,null,null,null,null,null,null,null,null,null,null,null,null,null,null,null,null,null,null,null,"2010-02-25"]
[null,null,null,null,null,null,null,null,null,null,null,null,null,null,null,null,null,null,null,null,null,null,null,null,null,null,null,null,null,null,null,null,null,null,null,null,null,null,null,null,null,null,null,null,null,null,null,null,null,null,null,null,null,null,null,null,null,null,null,null,null,null,"2010-02-26"]
[null,null,null,null,null,null,null,null,null,null,null,null,null,null,null,null,null,null,null,null,null,null,null,null,null,null,null,null,null,null,null,null,null,null,null,null,null,null,null,null,null,null,null,null,null,null,null,null,null,null,null,null,null,null,null,null,null,null,null,null,null,null,"2010-02-27"]
[null,null,null,null,null,null,null,null,null,null,null,null,null,null,null,null,null,null,null,null,null,null,null,null,null,null,null,null,null,null,null,null,null,null,null,null,null,null,null,null,null,null,null,null,null,null,null,null,null,null,null,null,null,null,null,null,null,null,null,null,null,null,"2010-02-28"]
[null,null,null,null,null,null,null,null,null,null,null,null,null,null,null,null,null,null,null,null,null,null,null,null,null,null,null,null,null,null,null,null,null,null,null,null,null,null,null,null,null,null,null,null,null,null,null,null,null,null,null,null,null,null,null,null,null,null,null,null,null,null,"2010-03-01"]
[null,null,null,null,null,null,null,null,null,null,null,null,null,null,null,null,null,null,null,null,null,null,null,null,null,null,null,null,null,null,null,null,null,null,null,null,null,null,null,null,null,null,null,null,null,null,null,null,null,null,null,null,null,null,null,null,null,null,null,null,null,null,"2010-03-02"]
[null,null,null,null,null,null,null,null,null,null,null,null,null,null,null,null,null,null,null,null,null,null,null,null,null,null,null,null,null,null,null,null,null,null,null,null,null,null,null,null,null,null,null,null,null,null,null,null,null,null,null,null,null,null,null,null,null,null,null,null,null,null,"2010-03-03"]
[null,null,null,null,null,null,null,null,null,null,null,null,null,null,null,null,null,null,null,null,null,null,null,null,null,null,null,null,null,null,null,null,null,null,null,null,null,null,null,null,null,null,null,null,null,null,null,null,null,null,null,null,null,null,null,null,null,null,null,null,null,null,"2010-03-04"]
[null,null,null,null,null,null,null,null,null,null,null,null,null,null,null,null,null,null,null,null,null,null,null,null,null,null,null,null,null,null,null,null,null,null,null,null,null,null,null,null,null,null,null,null,null,null,null,null,null,null,null,null,null,null,null,null,null,null,null,null,null,null,"2010-03-05"]
[null,null,null,null,null,null,null,null,null,null,null,null,null,null,null,null,null,null,null,null,null,null,null,null,null,null,null,null,null,null,null,null,null,null,null,null,null,null,null,null,null,null,null,null,null,null,null,null,null,null,null,null,null,null,null,null,null,null,null,null,null,null,"2010-03-06"]
[null,null,null,null,null,null,null,null,null,null,null,null,null,null,null,null,null,null,null,null,null,null,null,null,null,null,null,null,null,null,null,null,null,null,null,null,null,null,null,null,null,null,null,null,null,null,null,null,null,null,null,null,null,null,null,null,null,null,null,null,null,null,"2010-03-07"]
[null,null,null,null,null,null,null,null,null,null,null,null,null,null,null,null,null,null,null,null,null,null,null,null,null,null,null,null,null,null,null,null,null,null,null,null,null,null,null,null,null,null,null,null,null,null,null,null,null,null,null,null,null,null,null,null,null,null,null,null,null,null,"2010-03-08"]
[null,null,null,null,null,null,null,null,null,null,null,null,null,null,null,null,null,null,null,null,null,null,null,null,null,null,null,null,null,null,null,null,null,null,null,null,null,null,null,null,null,null,null,null,null,null,null,null,null,null,null,null,null,null,null,null,null,null,null,null,null,null,"2010-03-09"]
[null,null,null,null,null,null,null,null,null,null,null,null,null,null,null,null,null,null,null,null,null,null,null,null,null,null,null,null,null,null,null,null,null,null,null,null,null,null,null,null,null,null,null,null,null,null,null,null,null,null,null,null,null,null,null,null,null,null,null,null,null,null,"2010-03-10"]
[null,null,null,null,null,null,null,null,null,null,null,null,null,null,null,null,null,null,null,null,null,null,null,null,null,null,null,null,null,null,null,null,null,null,null,null,null,null,null,null,null,null,null,null,null,null,null,null,null,null,null,null,null,null,null,null,null,null,null,null,null,null,"2010-03-11"]
[null,null,null,null,null,null,null,null,null,null,null,null,null,null,null,null,null,null,null,null,null,null,null,null,null,null,null,null,null,null,null,null,null,null,null,null,null,null,null,null,null,null,null,null,null,null,null,null,null,null,null,null,null,null,null,null,null,null,null,null,null,null,"2010-03-12"]
[null,null,null,null,null,null,null,null,null,null,null,null,null,null,null,null,null,null,null,null,null,null,null,null,null,null,null,null,null,null,null,null,null,null,null,null,null,null,null,null,null,null,null,null,null,null,null,null,null,null,null,null,null,null,null,null,null,null,null,null,null,null,"2010-03-13"]
[null,null,null,null,null,null,null,null,null,null,null,null,null,null,null,null,null,null,null,null,null,null,null,null,null,null,null,null,null,null,null,null,null,null,null,null,null,null,null,null,null,null,null,null,null,null,null,null,null,null,null,null,null,null,null,null,null,null,null,null,null,null,"2010-03-14"]
[null,null,null,null,null,null,null,null,null,null,null,null,null,null,null,null,null,null,null,null,null,null,null,null,null,null,null,null,null,null,null,null,null,null,null,null,null,null,null,null,null,null,null,null,null,null,null,null,null,null,null,null,null,null,null,null,null,null,null,null,null,null,"2010-03-15"]
[null,null,null,null,null,null,null,null,null,null,null,null,null,null,null,null,null,null,null,null,null,null,null,null,null,null,null,null,null,null,null,null,null,null,null,null,null,null,null,null,null,null,null,null,null,null,null,null,null,null,null,null,null,null,null,null,null,null,null,null,null,null,"2010-03-16"]
[null,null,null,null,null,null,null,null,null,null,null,null,null,null,null,null,null,null,null,null,null,null,null,null,null,null,null,null,null,null,null,null,null,null,null,null,null,null,null,null,null,null,null,null,null,null,null,null,null,null,null,null,null,null,null,null,null,null,null,null,null,null,"2010-03-17"]
[null,null,null,null,null,null,null,null,null,null,null,null,null,null,null,null,null,null,null,null,null,null,null,null,null,null,null,null,null,null,null,null,null,null,null,null,null,null,null,null,null,null,null,null,null,null,null,null,null,null,null,null,null,null,null,null,null,null,null,null,null,null,"2010-03-18"]
[null,null,null,null,null,null,null,null,null,null,null,null,null,null,null,null,null,null,null,null,null,null,null,null,null,null,null,null,null,null,null,null,null,null,null,null,null,null,null,null,null,null,null,null,null,null,null,null,null,null,null,null,null,null,null,null,null,null,null,null,null,null,"2010-03-19"]
[null,null,null,null,null,null,null,null,null,null,null,null,null,null,null,null,null,null,null,null,null,null,null,null,null,null,null,null,null,null,null,null,null,null,null,null,null,null,null,null,null,null,null,null,null,null,null,null,null,null,null,null,null,null,null,null,null,null,null,null,null,null,"2010-03-20"]
[null,null,null,null,null,null,null,null,null,null,null,null,null,null,null,null,null,null,null,null,null,null,null,null,null,null,null,null,null,null,null,null,null,null,null,null,null,null,null,null,null,null,null,null,null,null,null,null,null,null,null,null,null,null,null,null,null,null,null,null,null,null,"2010-03-21"]
[null,null,null,null,null,null,null,null,null,null,null,null,null,null,null,null,null,null,null,null,null,null,null,null,null,null,null,null,null,null,null,null,null,null,null,null,null,null,null,null,null,null,null,null,null,null,null,null,null,null,null,null,null,null,null,null,null,null,null,null,null,null,"2010-03-22"]
[null,null,null,null,null,null,null,null,null,null,null,null,null,null,null,null,null,null,null,null,null,null,null,null,null,null,null,null,null,null,null,null,null,null,null,null,null,null,null,null,null,null,null,null,null,null,null,null,null,null,null,null,null,null,null,null,null,null,null,null,null,null,"2010-03-23"]
[null,null,null,null,null,null,null,null,null,null,null,null,null,null,null,null,null,null,null,null,null,null,null,null,null,null,null,null,null,null,null,null,null,null,null,null,null,null,null,null,null,null,null,null,null,null,null,null,null,null,null,null,null,null,null,null,null,null,null,null,null,null,"2010-03-24"]
[null,null,null,null,null,null,null,null,null,null,null,null,null,null,null,null,null,null,null,null,null,null,null,null,null,null,null,null,null,null,null,null,null,null,null,null,null,null,null,null,null,null,null,null,null,null,null,null,null,null,null,null,null,null,null,null,null,null,null,null,null,null,"2010-03-25"]
[null,null,null,null,null,null,null,null,null,null,null,null,null,null,null,null,null,null,null,null,null,null,null,null,null,null,null,null,null,null,null,null,null,null,null,null,null,null,null,null,null,null,null,null,null,null,null,null,null,null,null,null,null,null,null,null,null,null,null,null,null,null,"2010-03-26"]
[null,null,null,null,null,null,null,null,null,null,null,null,null,null,null,null,null,null,null,null,null,null,null,null,null,null,null,null,null,null,null,null,null,null,null,null,null,null,null,null,null,null,null,null,null,null,null,null,null,null,null,null,null,null,null,null,null,null,null,null,null,null,"2010-03-27"]
[null,null,null,null,null,null,null,null,null,null,null,null,null,null,null,null,null,null,null,null,null,null,null,null,null,null,null,null,null,null,null,null,null,null,null,null,null,null,null,null,null,null,null,null,null,null,null,null,null,null,null,null,null,null,null,null,null,null,null,null,null,null,"2010-03-28"]
[null,null,null,null,null,null,null,null,null,null,null,null,null,null,null,null,null,null,null,null,null,null,null,null,null,null,null,null,null,null,null,null,null,null,null,null,null,null,null,null,null,null,null,null,null,null,null,null,null,null,null,null,null,null,null,null,null,null,null,null,null,null,"2010-03-29"]
[null,null,null,null,null,null,null,null,null,null,null,null,null,null,null,null,null,null,null,null,null,null,null,null,null,null,null,null,null,null,null,null,null,null,null,null,null,null,null,null,null,null,null,null,null,null,null,null,null,null,null,null,null,null,null,null,null,null,null,null,null,null,"2010-03-30"]
[null,null,null,null,null,null,null,null,null,null,null,null,null,null,null,null,null,null,null,null,null,null,null,null,null,null,null,null,null,null,null,null,null,null,null,null,null,null,null,null,null,null,null,null,null,null,null,null,null,null,null,null,null,null,null,null,null,null,null,null,null,null,"2010-03-31"]
[null,null,null,null,null,null,null,null,null,null,null,null,null,null,null,null,null,null,null,null,null,null,null,null,null,null,null,null,null,null,null,null,null,null,null,null,null,null,null,null,null,null,null,null,null,null,null,null,null,null,null,null,null,null,null,null,null,null,null,null,null,null,"2010-04-01"]
[null,null,null,null,null,null,null,null,null,null,null,null,null,null,null,null,null,null,null,null,null,null,null,null,null,null,null,null,null,null,null,null,null,null,null,null,null,null,null,null,null,null,null,null,null,null,null,null,null,null,null,null,null,null,null,null,null,null,null,null,null,null,"2010-04-02"]
[null,null,null,null,null,null,null,null,null,null,null,null,null,null,null,null,null,null,null,null,null,null,null,null,null,null,null,null,null,null,null,null,null,null,null,null,null,null,null,null,null,null,null,null,null,null,null,null,null,null,null,null,null,null,null,null,null,null,null,null,null,null,"2010-04-03"]
[null,null,null,null,null,null,null,null,null,null,null,null,null,null,null,null,null,null,null,null,null,null,null,null,null,null,null,null,null,null,null,null,null,null,null,null,null,null,null,null,null,null,null,null,null,null,null,null,null,null,null,null,null,null,null,null,null,null,null,null,null,null,"2010-04-04"]
[null,null,null,null,null,null,null,null,null,null,null,null,null,null,null,null,null,null,null,null,null,null,null,null,null,null,null,null,null,null,null,null,null,null,null,null,null,null,null,null,null,null,null,null,null,null,null,null,null,null,null,null,null,null,null,null,null,null,null,null,null,null,"2010-04-05"]
[null,null,null,null,null,null,null,null,null,null,null,null,null,null,null,null,null,null,null,null,null,null,null,null,null,null,null,null,null,null,null,null,null,null,null,null,null,null,null,null,null,null,null,null,null,null,null,null,null,null,null,null,null,null,null,null,null,null,null,null,null,null,"2010-04-06"]
[null,null,null,null,null,null,null,null,null,null,null,null,null,null,null,null,null,null,null,null,null,null,null,null,null,null,null,null,null,null,null,null,null,null,null,null,null,null,null,null,null,null,null,null,null,null,null,null,null,null,null,null,null,null,null,null,null,null,null,null,null,null,"2010-04-07"]
[null,null,null,null,null,null,null,null,null,null,null,null,null,null,null,null,null,null,null,null,null,null,null,null,null,null,null,null,null,null,null,null,null,null,null,null,null,null,null,null,null,null,null,null,null,null,null,null,null,null,null,null,null,null,null,null,null,null,null,null,null,null,"2010-04-08"]
[null,null,null,null,null,null,null,null,null,null,null,null,null,null,null,null,null,null,null,null,null,null,null,null,null,null,null,null,null,null,null,null,null,null,null,null,null,null,null,null,null,null,null,null,null,null,null,null,null,null,null,null,null,null,null,null,null,null,null,null,null,null,"2010-04-09"]
[null,null,null,null,null,null,null,null,null,null,null,null,null,null,null,null,null,null,null,null,null,null,null,null,null,null,null,null,null,null,null,null,null,null,null,null,null,null,null,null,null,null,null,null,null,null,null,null,null,null,null,null,null,null,null,null,null,null,null,null,null,null,"2010-04-10"]
[null,null,null,null,null,null,null,null,null,null,null,null,null,null,null,null,null,null,null,null,null,null,null,null,null,null,null,null,null,null,null,null,null,null,null,null,null,null,null,null,null,null,null,null,null,null,null,null,null,null,null,null,null,null,null,null,null,null,null,null,null,null,"2010-04-11"]
[null,null,null,null,null,null,null,null,null,null,null,null,null,null,null,null,null,null,null,null,null,null,null,null,null,null,null,null,null,null,null,null,null,null,null,null,null,null,null,null,null,null,null,null,null,null,null,null,null,null,null,null,null,null,null,null,null,null,null,null,null,null,"2010-04-12"]
[null,null,null,null,null,null,null,null,null,null,null,null,null,null,null,null,null,null,null,null,null,null,null,null,null,null,null,null,null,null,null,null,null,null,null,null,null,null,null,null,null,null,null,null,null,null,null,null,null,null,null,null,null,null,null,null,null,null,null,null,null,null,"2010-04-13"]
[null,null,null,null,null,null,null,null,null,null,null,null,null,null,null,null,null,null,null,null,null,null,null,null,null,null,null,null,null,null,null,null,null,null,null,null,null,null,null,null,null,null,null,null,null,null,null,null,null,null,null,null,null,null,null,null,null,null,null,null,null,null,"2010-04-14"]
[null,null,null,null,null,null,null,null,null,null,null,null,null,null,null,null,null,null,null,null,null,null,null,null,null,null,null,null,null,null,null,null,null,null,null,null,null,null,null,null,null,null,null,null,null,null,null,null,null,null,null,null,null,null,null,null,null,null,null,null,null,null,"2010-04-15"]
[null,null,null,null,null,null,null,null,null,null,null,null,null,null,null,null,null,null,null,null,null,null,null,null,null,null,null,null,null,null,null,null,null,null,null,null,null,null,null,null,null,null,null,null,null,null,null,null,null,null,null,null,null,null,null,null,null,null,null,null,null,null,"2010-04-16"]
[null,null,null,null,null,null,null,null,null,null,null,null,null,null,null,null,null,null,null,null,null,null,null,null,null,null,null,null,null,null,null,null,null,null,null,null,null,null,null,null,null,null,null,null,null,null,null,null,null,null,null,null,null,null,null,null,null,null,null,null,null,null,"2010-04-17"]
[null,null,null,null,null,null,null,null,null,null,null,null,null,null,null,null,null,null,null,null,null,null,null,null,null,null,null,null,null,null,null,null,null,null,null,null,null,null,null,null,null,null,null,null,null,null,null,null,null,null,null,null,null,null,null,null,null,null,null,null,null,null,"2010-04-18"]
[null,null,null,null,null,null,null,null,null,null,null,null,null,null,null,null,null,null,null,null,null,null,null,null,null,null,null,null,null,null,null,null,null,null,null,null,null,null,null,null,null,null,null,null,null,null,null,null,null,null,null,null,null,null,null,null,null,null,null,null,null,null,"2010-04-19"]
[null,null,null,null,null,null,null,null,null,null,null,null,null,null,null,null,null,null,null,null,null,null,null,null,null,null,null,null,null,null,null,null,null,null,null,null,null,null,null,null,null,null,null,null,null,null,null,null,null,null,null,null,null,null,null,null,null,null,null,null,null,null,"2010-04-20"]
[null,null,null,null,null,null,null,null,null,null,null,null,null,null,null,null,null,null,null,null,null,null,null,null,null,null,null,null,null,null,null,null,null,null,null,null,null,null,null,null,null,null,null,null,null,null,null,null,null,null,null,null,null,null,null,null,null,null,null,null,null,null,"2010-04-21"]
[null,null,null,null,null,null,null,null,null,null,null,null,null,null,null,null,null,null,null,null,null,null,null,null,null,null,null,null,null,null,null,null,null,null,null,null,null,null,null,null,null,null,null,null,null,null,null,null,null,null,null,null,null,null,null,null,null,null,null,null,null,null,"2010-04-22"]
[null,null,null,null,null,null,null,null,null,null,null,null,null,null,null,null,null,null,null,null,null,null,null,null,null,null,null,null,null,null,null,null,null,null,null,null,null,null,null,null,null,null,null,null,null,null,null,null,null,null,null,null,null,null,null,null,null,null,null,null,null,null,"2010-04-23"]
[null,null,null,null,null,null,null,null,null,null,null,null,null,null,null,null,null,null,null,null,null,null,null,null,null,null,null,null,null,null,null,null,null,null,null,null,null,null,null,null,null,null,null,null,null,null,null,null,null,null,null,null,null,null,null,null,null,null,null,null,null,null,"2010-04-24"]
[null,null,null,null,null,null,null,null,null,null,null,null,null,null,null,null,null,null,null,null,null,null,null,null,null,null,null,null,null,null,null,null,null,null,null,null,null,null,null,null,null,null,null,null,null,null,null,null,null,null,null,null,null,null,null,null,null,null,null,null,null,null,"2010-04-25"]
[null,null,null,null,null,null,null,null,null,null,null,null,null,null,null,null,null,null,null,null,null,null,null,null,null,null,null,null,null,null,null,null,null,null,null,null,null,null,null,null,null,null,null,null,null,null,null,null,null,null,null,null,null,null,null,null,null,null,null,null,null,null,"2010-04-26"]
[null,null,null,null,null,null,null,null,null,null,null,null,null,null,null,null,null,null,null,null,null,null,null,null,null,null,null,null,null,null,null,null,null,null,null,null,null,null,null,null,null,null,null,null,null,null,null,null,null,null,null,null,null,null,null,null,null,null,null,null,null,null,"2010-04-27"]
[null,null,null,null,null,null,null,null,null,null,null,null,null,null,null,null,null,null,null,null,null,null,null,null,null,null,null,null,null,null,null,null,null,null,null,null,null,null,null,null,null,null,null,null,null,null,null,null,null,null,null,null,null,null,null,null,null,null,null,null,null,null,"2010-04-28"]
[null,null,null,null,null,null,null,null,null,null,null,null,null,null,null,null,null,null,null,null,null,null,null,null,null,null,null,null,null,null,null,null,null,null,null,null,null,null,null,null,null,null,null,null,null,null,null,null,null,null,null,null,null,null,null,null,null,null,null,null,null,null,"2010-04-29"]
[null,null,null,null,null,null,null,null,null,null,null,null,null,null,null,null,null,null,null,null,null,null,null,null,null,null,null,null,null,null,null,null,null,null,null,null,null,null,null,null,null,null,null,null,null,null,null,null,null,null,null,null,null,null,null,null,null,null,null,null,null,null,"2010-04-30"]
[null,null,null,null,null,null,null,null,null,null,null,null,null,null,null,null,null,null,null,null,null,null,null,null,null,null,null,null,null,null,null,null,null,null,null,null,null,null,null,null,null,null,null,null,null,null,null,null,null,null,null,null,null,null,null,null,null,null,null,null,null,null,"2010-05-01"]
[null,null,null,null,null,null,null,null,null,null,null,null,null,null,null,null,null,null,null,null,null,null,null,null,null,null,null,null,null,null,null,null,null,null,null,null,null,null,null,null,null,null,null,null,null,null,null,null,null,null,null,null,null,null,null,null,null,null,null,null,null,null,"2010-05-02"]
[null,null,null,null,null,null,null,null,null,null,null,null,null,null,null,null,null,null,null,null,null,null,null,null,null,null,null,null,null,null,null,null,null,null,null,null,null,null,null,null,null,null,null,null,null,null,null,null,null,null,null,null,null,null,null,null,null,null,null,null,null,null,"2010-05-03"]
[null,null,null,null,null,null,null,null,null,null,null,null,null,null,null,null,null,null,null,null,null,null,null,null,null,null,null,null,null,null,null,null,null,null,null,null,null,null,null,null,null,null,null,null,null,null,null,null,null,null,null,null,null,null,null,null,null,null,null,null,null,null,"2010-05-04"]
[null,null,null,null,null,null,null,null,null,null,null,null,null,null,null,null,null,null,null,null,null,null,null,null,null,null,null,null,null,null,null,null,null,null,null,null,null,null,null,null,null,null,null,null,null,null,null,null,null,null,null,null,null,null,null,null,null,null,null,null,null,null,"2010-05-05"]
[null,null,null,null,null,null,null,null,null,null,null,null,null,null,null,null,null,null,null,null,null,null,null,null,null,null,null,null,null,null,null,null,null,null,null,null,null,null,null,null,null,null,null,null,null,null,null,null,null,null,null,null,null,null,null,null,null,null,null,null,null,null,"2010-05-06"]
[null,null,null,null,null,null,null,null,null,null,null,null,null,null,null,null,null,null,null,null,null,null,null,null,null,null,null,null,null,null,null,null,null,null,null,null,null,null,null,null,null,null,null,null,null,null,null,null,null,null,null,null,null,null,null,null,null,null,null,null,null,null,"2010-05-07"]
[null,null,null,null,null,null,null,null,null,null,null,null,null,null,null,null,null,null,null,null,null,null,null,null,null,null,null,null,null,null,null,null,null,null,null,null,null,null,null,null,null,null,null,null,null,null,null,null,null,null,null,null,null,null,null,null,null,null,null,null,null,null,"2010-05-08"]
[null,null,null,null,null,null,null,null,null,null,null,null,null,null,null,null,null,null,null,null,null,null,null,null,null,null,null,null,null,null,null,null,null,null,null,null,null,null,null,null,null,null,null,null,null,null,null,null,null,null,null,null,null,null,null,null,null,null,null,null,null,null,"2010-05-09"]
[null,null,null,null,null,null,null,null,null,null,null,null,null,null,null,null,null,null,null,null,null,null,null,null,null,null,null,null,null,null,null,null,null,null,null,null,null,null,null,null,null,null,null,null,null,null,null,null,null,null,null,null,null,null,null,null,null,null,null,null,null,null,"2010-05-10"]
[null,null,null,null,null,null,null,null,null,null,null,null,null,null,null,null,null,null,null,null,null,null,null,null,null,null,null,null,null,null,null,null,null,null,null,null,null,null,null,null,null,null,null,null,null,null,null,null,null,null,null,null,null,null,null,null,null,null,null,null,null,null,"2010-05-11"]
[null,null,null,null,null,null,null,null,null,null,null,null,null,null,null,null,null,null,null,null,null,null,null,null,null,null,null,null,null,null,null,null,null,null,null,null,null,null,null,null,null,null,null,null,null,null,null,null,null,null,null,null,null,null,null,null,null,null,null,null,null,null,"2010-05-12"]
[null,null,null,null,null,null,null,null,null,null,null,null,null,null,null,null,null,null,null,null,null,null,null,null,null,null,null,null,null,null,null,null,null,null,null,null,null,null,null,null,null,null,null,null,null,null,null,null,null,null,null,null,null,null,null,null,null,null,null,null,null,null,"2010-05-13"]
[null,null,null,null,null,null,null,null,null,null,null,null,null,null,null,null,null,null,null,null,null,null,null,null,null,null,null,null,null,null,null,null,null,null,null,null,null,null,null,null,null,null,null,null,null,null,null,null,null,null,null,null,null,null,null,null,null,null,null,null,null,null,"2010-05-14"]
[null,null,null,null,null,null,null,null,null,null,null,null,null,null,null,null,null,null,null,null,null,null,null,null,null,null,null,null,null,null,null,null,null,null,null,null,null,null,null,null,null,null,null,null,null,null,null,null,null,null,null,null,null,null,null,null,null,null,null,null,null,null,"2010-05-15"]
[null,null,null,null,null,null,null,null,null,null,null,null,null,null,null,null,null,null,null,null,null,null,null,null,null,null,null,null,null,null,null,null,null,null,null,null,null,null,null,null,null,null,null,null,null,null,null,null,null,null,null,null,null,null,null,null,null,null,null,null,null,null,"2010-05-16"]
[null,null,null,null,null,null,null,null,null,null,null,null,null,null,null,null,null,null,null,null,null,null,null,null,null,null,null,null,null,null,null,null,null,null,null,null,null,null,null,null,null,null,null,null,null,null,null,null,null,null,null,null,null,null,null,null,null,null,null,null,null,null,"2010-05-17"]
[null,null,null,null,null,null,null,null,null,null,null,null,null,null,null,null,null,null,null,null,null,null,null,null,null,null,null,null,null,null,null,null,null,null,null,null,null,null,null,null,null,null,null,null,null,null,null,null,null,null,null,null,null,null,null,null,null,null,null,null,null,null,"2010-05-18"]
[null,null,null,null,null,null,null,null,null,null,null,null,null,null,null,null,null,null,null,null,null,null,null,null,null,null,null,null,null,null,null,null,null,null,null,null,null,null,null,null,null,null,null,null,null,null,null,null,null,null,null,null,null,null,null,null,null,null,null,null,null,null,"2010-05-19"]
[null,null,null,null,null,null,null,null,null,null,null,null,null,null,null,null,null,null,null,null,null,null,null,null,null,null,null,null,null,null,null,null,null,null,null,null,null,null,null,null,null,null,null,null,null,null,null,null,null,null,null,null,null,null,null,null,null,null,null,null,null,null,"2010-05-20"]
[null,null,null,null,null,null,null,null,null,null,null,null,null,null,null,null,null,null,null,null,null,null,null,null,null,null,null,null,null,null,null,null,null,null,null,null,null,null,null,null,null,null,null,null,null,null,null,null,null,null,null,null,null,null,null,null,null,null,null,null,null,null,"2010-05-21"]
[null,null,null,null,null,null,null,null,null,null,null,null,null,null,null,null,null,null,null,null,null,null,null,null,null,null,null,null,null,null,null,null,null,null,null,null,null,null,null,null,null,null,null,null,null,null,null,null,null,null,null,null,null,null,null,null,null,null,null,null,null,null,"2010-05-22"]
[null,null,null,null,null,null,null,null,null,null,null,null,null,null,null,null,null,null,null,null,null,null,null,null,null,null,null,null,null,null,null,null,null,null,null,null,null,null,null,null,null,null,null,null,null,null,null,null,null,null,null,null,null,null,null,null,null,null,null,null,null,null,"2010-05-23"]
[null,null,null,null,null,null,null,null,null,null,null,null,null,null,null,null,null,null,null,null,null,null,null,null,null,null,null,null,null,null,null,null,null,null,null,null,null,null,null,null,null,null,null,null,null,null,null,null,null,null,null,null,null,null,null,null,null,null,null,null,null,null,"2010-05-24"]
[null,null,null,null,null,null,null,null,null,null,null,null,null,null,null,null,null,null,null,null,null,null,null,null,null,null,null,null,null,null,null,null,null,null,null,null,null,null,null,null,null,null,null,null,null,null,null,null,null,null,null,null,null,null,null,null,null,null,null,null,null,null,"2010-05-25"]
[null,null,null,null,null,null,null,null,null,null,null,null,null,null,null,null,null,null,null,null,null,null,null,null,null,null,null,null,null,null,null,null,null,null,null,null,null,null,null,null,null,null,null,null,null,null,null,null,null,null,null,null,null,null,null,null,null,null,null,null,null,null,"2010-05-26"]
[null,null,null,null,null,null,null,null,null,null,null,null,null,null,null,null,null,null,null,null,null,null,null,null,null,null,null,null,null,null,null,null,null,null,null,null,null,null,null,null,null,null,null,null,null,null,null,null,null,null,null,null,null,null,null,null,null,null,null,null,null,null,"2010-05-27"]
[null,null,null,null,null,null,null,null,null,null,null,null,null,null,null,null,null,null,null,null,null,null,null,null,null,null,null,null,null,null,null,null,null,null,null,null,null,null,null,null,null,null,null,null,null,null,null,null,null,null,null,null,null,null,null,null,null,null,null,null,null,null,"2010-05-28"]
[null,null,null,null,null,null,null,null,null,null,null,null,null,null,null,null,null,null,null,null,null,null,null,null,null,null,null,null,null,null,null,null,null,null,null,null,null,null,null,null,null,null,null,null,null,null,null,null,null,null,null,null,null,null,null,null,null,null,null,null,null,null,"2010-05-29"]
[null,null,null,null,null,null,null,null,null,null,null,null,null,null,null,null,null,null,null,null,null,null,null,null,null,null,null,null,null,null,null,null,null,null,null,null,null,null,null,null,null,null,null,null,null,null,null,null,null,null,null,null,null,null,null,null,null,null,null,null,null,null,"2010-05-30"]
[null,null,null,null,null,null,null,null,null,null,null,null,null,null,null,null,null,null,null,null,null,null,null,null,null,null,null,null,null,null,null,null,null,null,null,null,null,null,null,null,null,null,null,null,null,null,null,null,null,null,null,null,null,null,null,null,null,null,null,null,null,null,"2010-05-31"]
[null,null,null,null,null,null,null,null,null,null,null,null,null,null,null,null,null,null,null,null,null,null,null,null,null,null,null,null,null,null,null,null,null,null,null,null,null,null,null,null,null,null,null,null,null,null,null,null,null,null,null,null,null,null,null,null,null,null,null,null,null,null,"2010-06-01"]
[null,null,null,null,null,null,null,null,null,null,null,null,null,null,null,null,null,null,null,null,null,null,null,null,null,null,null,null,null,null,null,null,null,null,null,null,null,null,null,null,null,null,null,null,null,null,null,null,null,null,null,null,null,null,null,null,null,null,null,null,null,null,"2010-06-02"]
[null,null,null,null,null,null,null,null,null,null,null,null,null,null,null,null,null,null,null,null,null,null,null,null,null,null,null,null,null,null,null,null,null,null,null,null,null,null,null,null,null,null,null,null,null,null,null,null,null,null,null,null,null,null,null,null,null,null,null,null,null,null,"2010-06-03"]
[null,null,null,null,null,null,null,null,null,null,null,null,null,null,null,null,null,null,null,null,null,null,null,null,null,null,null,null,null,null,null,null,null,null,null,null,null,null,null,null,null,null,null,null,null,null,null,null,null,null,null,null,null,null,null,null,null,null,null,null,null,null,"2010-06-04"]
[null,null,null,null,null,null,null,null,null,null,null,null,null,null,null,null,null,null,null,null,null,null,null,null,null,null,null,null,null,null,null,null,null,null,null,null,null,null,null,null,null,null,null,null,null,null,null,null,null,null,null,null,null,null,null,null,null,null,null,null,null,null,"2010-06-05"]
[null,null,null,null,null,null,null,null,null,null,null,null,null,null,null,null,null,null,null,null,null,null,null,null,null,null,null,null,null,null,null,null,null,null,null,null,null,null,null,null,null,null,null,null,null,null,null,null,null,null,null,null,null,null,null,null,null,null,null,null,null,null,"2010-06-06"]
[null,null,null,null,null,null,null,null,null,null,null,null,null,null,null,null,null,null,null,null,null,null,null,null,null,null,null,null,null,null,null,null,null,null,null,null,null,null,null,null,null,null,null,null,null,null,null,null,null,null,null,null,null,null,null,null,null,null,null,null,null,null,"2010-06-07"]
[null,null,null,null,null,null,null,null,null,null,null,null,null,null,null,null,null,null,null,null,null,null,null,null,null,null,null,null,null,null,null,null,null,null,null,null,null,null,null,null,null,null,null,null,null,null,null,null,null,null,null,null,null,null,null,null,null,null,null,null,null,null,"2010-06-08"]
[null,null,null,null,null,null,null,null,null,null,null,null,null,null,null,null,null,null,null,null,null,null,null,null,null,null,null,null,null,null,null,null,null,null,null,null,null,null,null,null,null,null,null,null,null,null,null,null,null,null,null,null,null,null,null,null,null,null,null,null,null,null,"2010-06-09"]
[null,null,null,null,null,null,null,null,null,null,null,null,null,null,null,null,null,null,null,null,null,null,null,null,null,null,null,null,null,null,null,null,null,null,null,null,null,null,null,null,null,null,null,null,null,null,null,null,null,null,null,null,null,null,null,null,null,null,null,null,null,null,"2010-06-10"]
[null,null,null,null,null,null,null,null,null,null,null,null,null,null,null,null,null,null,null,null,null,null,null,null,null,null,null,null,null,null,null,null,null,null,null,null,null,null,null,null,null,null,null,null,null,null,null,null,null,null,null,null,null,null,null,null,null,null,null,null,null,null,"2010-06-11"]
[null,null,null,null,null,null,null,null,null,null,null,null,null,null,null,null,null,null,null,null,null,null,null,null,null,null,null,null,null,null,null,null,null,null,null,null,null,null,null,null,null,null,null,null,null,null,null,null,null,null,null,null,null,null,null,null,null,null,null,null,null,null,"2010-06-12"]
[null,null,null,null,null,null,null,null,null,null,null,null,null,null,null,null,null,null,null,null,null,null,null,null,null,null,null,null,null,null,null,null,null,null,null,null,null,null,null,null,null,null,null,null,null,null,null,null,null,null,null,null,null,null,null,null,null,null,null,null,null,null,"2010-06-13"]
[null,null,null,null,null,null,null,null,null,null,null,null,null,null,null,null,null,null,null,null,null,null,null,null,null,null,null,null,null,null,null,null,null,null,null,null,null,null,null,null,null,null,null,null,null,null,null,null,null,null,null,null,null,null,null,null,null,null,null,null,null,null,"2010-06-14"]
[null,null,null,null,null,null,null,null,null,null,null,null,null,null,null,null,null,null,null,null,null,null,null,null,null,null,null,null,null,null,null,null,null,null,null,null,null,null,null,null,null,null,null,null,null,null,null,null,null,null,null,null,null,null,null,null,null,null,null,null,null,null,"2010-06-15"]
[null,null,null,null,null,null,null,null,null,null,null,null,null,null,null,null,null,null,null,null,null,null,null,null,null,null,null,null,null,null,null,null,null,null,null,null,null,null,null,null,null,null,null,null,null,null,null,null,null,null,null,null,null,null,null,null,null,null,null,null,null,null,"2010-06-16"]
[null,null,null,null,null,null,null,null,null,null,null,null,null,null,null,null,null,null,null,null,null,null,null,null,null,null,null,null,null,null,null,null,null,null,null,null,null,null,null,null,null,null,null,null,null,null,null,null,null,null,null,null,null,null,null,null,null,null,null,null,null,null,"2010-06-17"]
[null,null,null,null,null,null,null,null,null,null,null,null,null,null,null,null,null,null,null,null,null,null,null,null,null,null,null,null,null,null,null,null,null,null,null,null,null,null,null,null,null,null,null,null,null,null,null,null,null,null,null,null,null,null,null,null,null,null,null,null,null,null,"2010-06-18"]
[null,null,null,null,null,null,null,null,null,null,null,null,null,null,null,null,null,null,null,null,null,null,null,null,null,null,null,null,null,null,null,null,null,null,null,null,null,null,null,null,null,null,null,null,null,null,null,null,null,null,null,null,null,null,null,null,null,null,null,null,null,null,"2010-06-19"]
[null,null,null,null,null,null,null,null,null,null,null,null,null,null,null,null,null,null,null,null,null,null,null,null,null,null,null,null,null,null,null,null,null,null,null,null,null,null,null,null,null,null,null,null,null,null,null,null,null,null,null,null,null,null,null,null,null,null,null,null,null,null,"2010-06-20"]
[null,null,null,null,null,null,null,null,null,null,null,null,null,null,null,null,null,null,null,null,null,null,null,null,null,null,null,null,null,null,null,null,null,null,null,null,null,null,null,null,null,null,null,null,null,null,null,null,null,null,null,null,null,null,null,null,null,null,null,null,null,null,"2010-06-21"]
[null,null,null,null,null,null,null,null,null,null,null,null,null,null,null,null,null,null,null,null,null,null,null,null,null,null,null,null,null,null,null,null,null,null,null,null,null,null,null,null,null,null,null,null,null,null,null,null,null,null,null,null,null,null,null,null,null,null,null,null,null,null,"2010-06-22"]
[null,null,null,null,null,null,null,null,null,null,null,null,null,null,null,null,null,null,null,null,null,null,null,null,null,null,null,null,null,null,null,null,null,null,null,null,null,null,null,null,null,null,null,null,null,null,null,null,null,null,null,null,null,null,null,null,null,null,null,null,null,null,"2010-06-23"]
[null,null,null,null,null,null,null,null,null,null,null,null,null,null,null,null,null,null,null,null,null,null,null,null,null,null,null,null,null,null,null,null,null,null,null,null,null,null,null,null,null,null,null,null,null,null,null,null,null,null,null,null,null,null,null,null,null,null,null,null,null,null,"2010-06-24"]
[null,null,null,null,null,null,null,null,null,null,null,null,null,null,null,null,null,null,null,null,null,null,null,null,null,null,null,null,null,null,null,null,null,null,null,null,null,null,null,null,null,null,null,null,null,null,null,null,null,null,null,null,null,null,null,null,null,null,null,null,null,null,"2010-06-25"]
[null,null,null,null,null,null,null,null,null,null,null,null,null,null,null,null,null,null,null,null,null,null,null,null,null,null,null,null,null,null,null,null,null,null,null,null,null,null,null,null,null,null,null,null,null,null,null,null,null,null,null,null,null,null,null,null,null,null,null,null,null,null,"2010-06-26"]
[null,null,null,null,null,null,null,null,null,null,null,null,null,null,null,null,null,null,null,null,null,null,null,null,null,null,null,null,null,null,null,null,null,null,null,null,null,null,null,null,null,null,null,null,null,null,null,null,null,null,null,null,null,null,null,null,null,null,null,null,null,null,"2010-06-27"]
[null,null,null,null,null,null,null,null,null,null,null,null,null,null,null,null,null,null,null,null,null,null,null,null,null,null,null,null,null,null,null,null,null,null,null,null,null,null,null,null,null,null,null,null,null,null,null,null,null,null,null,null,null,null,null,null,null,null,null,null,null,null,"2010-06-28"]
[null,null,null,null,null,null,null,null,null,null,null,null,null,null,null,null,null,null,null,null,null,null,null,null,null,null,null,null,null,null,null,null,null,null,null,null,null,null,null,null,null,null,null,null,null,null,null,null,null,null,null,null,null,null,null,null,null,null,null,null,null,null,"2010-06-29"]
[null,null,null,null,null,null,null,null,null,null,null,null,null,null,null,null,null,null,null,null,null,null,null,null,null,null,null,null,null,null,null,null,null,null,null,null,null,null,null,null,null,null,null,null,null,null,null,null,null,null,null,null,null,null,null,null,null,null,null,null,null,null,"2010-06-30"]
[null,null,null,null,null,null,null,null,null,null,null,null,null,null,null,null,null,null,null,null,null,null,null,null,null,null,null,null,null,null,null,null,null,null,null,null,null,null,null,null,null,null,null,null,null,null,null,null,null,null,null,null,null,null,null,null,null,null,null,null,null,null,"2010-07-01"]
[null,null,null,null,null,null,null,null,null,null,null,null,null,null,null,null,null,null,null,null,null,null,null,null,null,null,null,null,null,null,null,null,null,null,null,null,null,null,null,null,null,null,null,null,null,null,null,null,null,null,null,null,null,null,null,null,null,null,null,null,null,null,"2010-07-02"]
[null,null,null,null,null,null,null,null,null,null,null,null,null,null,null,null,null,null,null,null,null,null,null,null,null,null,null,null,null,null,null,null,null,null,null,null,null,null,null,null,null,null,null,null,null,null,null,null,null,null,null,null,null,null,null,null,null,null,null,null,null,null,"2010-07-03"]
[null,null,null,null,null,null,null,null,null,null,null,null,null,null,null,null,null,null,null,null,null,null,null,null,null,null,null,null,null,null,null,null,null,null,null,null,null,null,null,null,null,null,null,null,null,null,null,null,null,null,null,null,null,null,null,null,null,null,null,null,null,null,"2010-07-04"]
[null,null,null,null,null,null,null,null,null,null,null,null,null,null,null,null,null,null,null,null,null,null,null,null,null,null,null,null,null,null,null,null,null,null,null,null,null,null,null,null,null,null,null,null,null,null,null,null,null,null,null,null,null,null,null,null,null,null,null,null,null,null,"2010-07-05"]
[null,null,null,null,null,null,null,null,null,null,null,null,null,null,null,null,null,null,null,null,null,null,null,null,null,null,null,null,null,null,null,null,null,null,null,null,null,null,null,null,null,null,null,null,null,null,null,null,null,null,null,null,null,null,null,null,null,null,null,null,null,null,"2010-07-06"]
[null,null,null,null,null,null,null,null,null,null,null,null,null,null,null,null,null,null,null,null,null,null,null,null,null,null,null,null,null,null,null,null,null,null,null,null,null,null,null,null,null,null,null,null,null,null,null,null,null,null,null,null,null,null,null,null,null,null,null,null,null,null,"2010-07-07"]
[null,null,null,null,null,null,null,null,null,null,null,null,null,null,null,null,null,null,null,null,null,null,null,null,null,null,null,null,null,null,null,null,null,null,null,null,null,null,null,null,null,null,null,null,null,null,null,null,null,null,null,null,null,null,null,null,null,null,null,null,null,null,"2010-07-08"]
[null,null,null,null,null,null,null,null,null,null,null,null,null,null,null,null,null,null,null,null,null,null,null,null,null,null,null,null,null,null,null,null,null,null,null,null,null,null,null,null,null,null,null,null,null,null,null,null,null,null,null,null,null,null,null,null,null,null,null,null,null,null,"2010-07-09"]
[null,null,null,null,null,null,null,null,null,null,null,null,null,null,null,null,null,null,null,null,null,null,null,null,null,null,null,null,null,null,null,null,null,null,null,null,null,null,null,null,null,null,null,null,null,null,null,null,null,null,null,null,null,null,null,null,null,null,null,null,null,null,"2010-07-10"]
[null,null,null,null,null,null,null,null,null,null,null,null,null,null,null,null,null,null,null,null,null,null,null,null,null,null,null,null,null,null,null,null,null,null,null,null,null,null,null,null,null,null,null,null,null,null,null,null,null,null,null,null,null,null,null,null,null,null,null,null,null,null,"2010-07-11"]
[null,null,null,null,null,null,null,null,null,null,null,null,null,null,null,null,null,null,null,null,null,null,null,null,null,null,null,null,null,null,null,null,null,null,null,null,null,null,null,null,null,null,null,null,null,null,null,null,null,null,null,null,null,null,null,null,null,null,null,null,null,null,"2010-07-12"]
[null,null,null,null,null,null,null,null,null,null,null,null,null,null,null,null,null,null,null,null,null,null,null,null,null,null,null,null,null,null,null,null,null,null,null,null,null,null,null,null,null,null,null,null,null,null,null,null,null,null,null,null,null,null,null,null,null,null,null,null,null,null,"2010-07-13"]
[null,null,null,null,null,null,null,null,null,null,null,null,null,null,null,null,null,null,null,null,null,null,null,null,null,null,null,null,null,null,null,null,null,null,null,null,null,null,null,null,null,null,null,null,null,null,null,null,null,null,null,null,null,null,null,null,null,null,null,null,null,null,"2010-07-14"]
[null,null,null,null,null,null,null,null,null,null,null,null,null,null,null,null,null,null,null,null,null,null,null,null,null,null,null,null,null,null,null,null,null,null,null,null,null,null,null,null,null,null,null,null,null,null,null,null,null,null,null,null,null,null,null,null,null,null,null,null,null,null,"2010-07-15"]
[null,null,null,null,null,null,null,null,null,null,null,null,null,null,null,null,null,null,null,null,null,null,null,null,null,null,null,null,null,null,null,null,null,null,null,null,null,null,null,null,null,null,null,null,null,null,null,null,null,null,null,null,null,null,null,null,null,null,null,null,null,null,"2010-07-16"]
[null,null,null,null,null,null,null,null,null,null,null,null,null,null,null,null,null,null,null,null,null,null,null,null,null,null,null,null,null,null,null,null,null,null,null,null,null,null,null,null,null,null,null,null,null,null,null,null,null,null,null,null,null,null,null,null,null,null,null,null,null,null,"2010-07-17"]
[null,null,null,null,null,null,null,null,null,null,null,null,null,null,null,null,null,null,null,null,null,null,null,null,null,null,null,null,null,null,null,null,null,null,null,null,null,null,null,null,null,null,null,null,null,null,null,null,null,null,null,null,null,null,null,null,null,null,null,null,null,null,"2010-07-18"]
[null,null,null,null,null,null,null,null,null,null,null,null,null,null,null,null,null,null,null,null,null,null,null,null,null,null,null,null,null,null,null,null,null,null,null,null,null,null,null,null,null,null,null,null,null,null,null,null,null,null,null,null,null,null,null,null,null,null,null,null,null,null,"2010-07-19"]
[null,null,null,null,null,null,null,null,null,null,null,null,null,null,null,null,null,null,null,null,null,null,null,null,null,null,null,null,null,null,null,null,null,null,null,null,null,null,null,null,null,null,null,null,null,null,null,null,null,null,null,null,null,null,null,null,null,null,null,null,null,null,"2010-07-20"]
[null,null,null,null,null,null,null,null,null,null,null,null,null,null,null,null,null,null,null,null,null,null,null,null,null,null,null,null,null,null,null,null,null,null,null,null,null,null,null,null,null,null,null,null,null,null,null,null,null,null,null,null,null,null,null,null,null,null,null,null,null,null,"2010-07-21"]
[null,null,null,null,null,null,null,null,null,null,null,null,null,null,null,null,null,null,null,null,null,null,null,null,null,null,null,null,null,null,null,null,null,null,null,null,null,null,null,null,null,null,null,null,null,null,null,null,null,null,null,null,null,null,null,null,null,null,null,null,null,null,"2010-07-22"]
[null,null,null,null,null,null,null,null,null,null,null,null,null,null,null,null,null,null,null,null,null,null,null,null,null,null,null,null,null,null,null,null,null,null,null,null,null,null,null,null,null,null,null,null,null,null,null,null,null,null,null,null,null,null,null,null,null,null,null,null,null,null,"2010-07-23"]
[null,null,null,null,null,null,null,null,null,null,null,null,null,null,null,null,null,null,null,null,null,null,null,null,null,null,null,null,null,null,null,null,null,null,null,null,null,null,null,null,null,null,null,null,null,null,null,null,null,null,null,null,null,null,null,null,null,null,null,null,null,null,"2010-07-24"]
[null,null,null,null,null,null,null,null,null,null,null,null,null,null,null,null,null,null,null,null,null,null,null,null,null,null,null,null,null,null,null,null,null,null,null,null,null,null,null,null,null,null,null,null,null,null,null,null,null,null,null,null,null,null,null,null,null,null,null,null,null,null,"2010-07-25"]
[null,null,null,null,null,null,null,null,null,null,null,null,null,null,null,null,null,null,null,null,null,null,null,null,null,null,null,null,null,null,null,null,null,null,null,null,null,null,null,null,null,null,null,null,null,null,null,null,null,null,null,null,null,null,null,null,null,null,null,null,null,null,"2010-07-26"]
[null,null,null,null,null,null,null,null,null,null,null,null,null,null,null,null,null,null,null,null,null,null,null,null,null,null,null,null,null,null,null,null,null,null,null,null,null,null,null,null,null,null,null,null,null,null,null,null,null,null,null,null,null,null,null,null,null,null,null,null,null,null,"2010-07-27"]
[null,null,null,null,null,null,null,null,null,null,null,null,null,null,null,null,null,null,null,null,null,null,null,null,null,null,null,null,null,null,null,null,null,null,null,null,null,null,null,null,null,null,null,null,null,null,null,null,null,null,null,null,null,null,null,null,null,null,null,null,null,null,"2010-07-28"]
[null,null,null,null,null,null,null,null,null,null,null,null,null,null,null,null,null,null,null,null,null,null,null,null,null,null,null,null,null,null,null,null,null,null,null,null,null,null,null,null,null,null,null,null,null,null,null,null,null,null,null,null,null,null,null,null,null,null,null,null,null,null,"2010-07-29"]
[null,null,null,null,null,null,null,null,null,null,null,null,null,null,null,null,null,null,null,null,null,null,null,null,null,null,null,null,null,null,null,null,null,null,null,null,null,null,null,null,null,null,null,null,null,null,null,null,null,null,null,null,null,null,null,null,null,null,null,null,null,null,"2010-07-30"]
[null,null,null,null,null,null,null,null,null,null,null,null,null,null,null,null,null,null,null,null,null,null,null,null,null,null,null,null,null,null,null,null,null,null,null,null,null,null,null,null,null,null,null,null,null,null,null,null,null,null,null,null,null,null,null,null,null,null,null,null,null,null,"2010-07-31"]
[null,null,null,null,null,null,null,null,null,null,null,null,null,null,null,null,null,null,null,null,null,null,null,null,null,null,null,null,null,null,null,null,null,null,null,null,null,null,null,null,null,null,null,null,null,null,null,null,null,null,null,null,null,null,null,null,null,null,null,null,null,null,"2010-08-01"]
[null,null,null,null,null,null,null,null,null,null,null,null,null,null,null,null,null,null,null,null,null,null,null,null,null,null,null,null,null,null,null,null,null,null,null,null,null,null,null,null,null,null,null,null,null,null,null,null,null,null,null,null,null,null,null,null,null,null,null,null,null,null,"2010-08-02"]
[null,null,null,null,null,null,null,null,null,null,null,null,null,null,null,null,null,null,null,null,null,null,null,null,null,null,null,null,null,null,null,null,null,null,null,null,null,null,null,null,null,null,null,null,null,null,null,null,null,null,null,null,null,null,null,null,null,null,null,null,null,null,"2010-08-03"]
[null,null,null,null,null,null,null,null,null,null,null,null,null,null,null,null,null,null,null,null,null,null,null,null,null,null,null,null,null,null,null,null,null,null,null,null,null,null,null,null,null,null,null,null,null,null,null,null,null,null,null,null,null,null,null,null,null,null,null,null,null,null,"2010-08-04"]
[null,null,null,null,null,null,null,null,null,null,null,null,null,null,null,null,null,null,null,null,null,null,null,null,null,null,null,null,null,null,null,null,null,null,null,null,null,null,null,null,null,null,null,null,null,null,null,null,null,null,null,null,null,null,null,null,null,null,null,null,null,null,"2010-08-05"]
[null,null,null,null,null,null,null,null,null,null,null,null,null,null,null,null,null,null,null,null,null,null,null,null,null,null,null,null,null,null,null,null,null,null,null,null,null,null,null,null,null,null,null,null,null,null,null,null,null,null,null,null,null,null,null,null,null,null,null,null,null,null,"2010-08-06"]
[null,null,null,null,null,null,null,null,null,null,null,null,null,null,null,null,null,null,null,null,null,null,null,null,null,null,null,null,null,null,null,null,null,null,null,null,null,null,null,null,null,null,null,null,null,null,null,null,null,null,null,null,null,null,null,null,null,null,null,null,null,null,"2010-08-07"]
[null,null,null,null,null,null,null,null,null,null,null,null,null,null,null,null,null,null,null,null,null,null,null,null,null,null,null,null,null,null,null,null,null,null,null,null,null,null,null,null,null,null,null,null,null,null,null,null,null,null,null,null,null,null,null,null,null,null,null,null,null,null,"2010-08-08"]
[null,null,null,null,null,null,null,null,null,null,null,null,null,null,null,null,null,null,null,null,null,null,null,null,null,null,null,null,null,null,null,null,null,null,null,null,null,null,null,null,null,null,null,null,null,null,null,null,null,null,null,null,null,null,null,null,null,null,null,null,null,null,"2010-08-09"]
[null,null,null,null,null,null,null,null,null,null,null,null,null,null,null,null,null,null,null,null,null,null,null,null,null,null,null,null,null,null,null,null,null,null,null,null,null,null,null,null,null,null,null,null,null,null,null,null,null,null,null,null,null,null,null,null,null,null,null,null,null,null,"2010-08-10"]
[null,null,null,null,null,null,null,null,null,null,null,null,null,null,null,null,null,null,null,null,null,null,null,null,null,null,null,null,null,null,null,null,null,null,null,null,null,null,null,null,null,null,null,null,null,null,null,null,null,null,null,null,null,null,null,null,null,null,null,null,null,null,"2010-08-11"]
[null,null,null,null,null,null,null,null,null,null,null,null,null,null,null,null,null,null,null,null,null,null,null,null,null,null,null,null,null,null,null,null,null,null,null,null,null,null,null,null,null,null,null,null,null,null,null,null,null,null,null,null,null,null,null,null,null,null,null,null,null,null,"2010-08-12"]
[null,null,null,null,null,null,null,null,null,null,null,null,null,null,null,null,null,null,null,null,null,null,null,null,null,null,null,null,null,null,null,null,null,null,null,null,null,null,null,null,null,null,null,null,null,null,null,null,null,null,null,null,null,null,null,null,null,null,null,null,null,null,"2010-08-13"]
[null,null,null,null,null,null,null,null,null,null,null,null,null,null,null,null,null,null,null,null,null,null,null,null,null,null,null,null,null,null,null,null,null,null,null,null,null,null,null,null,null,null,null,null,null,null,null,null,null,null,null,null,null,null,null,null,null,null,null,null,null,null,"2010-08-14"]
[null,null,null,null,null,null,null,null,null,null,null,null,null,null,null,null,null,null,null,null,null,null,null,null,null,null,null,null,null,null,null,null,null,null,null,null,null,null,null,null,null,null,null,null,null,null,null,null,null,null,null,null,null,null,null,null,null,null,null,null,null,null,"2010-08-15"]
[null,null,null,null,null,null,null,null,null,null,null,null,null,null,null,null,null,null,null,null,null,null,null,null,null,null,null,null,null,null,null,null,null,null,null,null,null,null,null,null,null,null,null,null,null,null,null,null,null,null,null,null,null,null,null,null,null,null,null,null,null,null,"2010-08-16"]
[null,null,null,null,null,null,null,null,null,null,null,null,null,null,null,null,null,null,null,null,null,null,null,null,null,null,null,null,null,null,null,null,null,null,null,null,null,null,null,null,null,null,null,null,null,null,null,null,null,null,null,null,null,null,null,null,null,null,null,null,null,null,"2010-08-17"]
[null,null,null,null,null,null,null,null,null,null,null,null,null,null,null,null,null,null,null,null,null,null,null,null,null,null,null,null,null,null,null,null,null,null,null,null,null,null,null,null,null,null,null,null,null,null,null,null,null,null,null,null,null,null,null,null,null,null,null,null,null,null,"2010-08-18"]
[null,null,null,null,null,null,null,null,null,null,null,null,null,null,null,null,null,null,null,null,null,null,null,null,null,null,null,null,null,null,null,null,null,null,null,null,null,null,null,null,null,null,null,null,null,null,null,null,null,null,null,null,null,null,null,null,null,null,null,null,null,null,"2010-08-19"]
[null,null,null,null,null,null,null,null,null,null,null,null,null,null,null,null,null,null,null,null,null,null,null,null,null,null,null,null,null,null,null,null,null,null,null,null,null,null,null,null,null,null,null,null,null,null,null,null,null,null,null,null,null,null,null,null,null,null,null,null,null,null,"2010-08-20"]
[null,null,null,null,null,null,null,null,null,null,null,null,null,null,null,null,null,null,null,null,null,null,null,null,null,null,null,null,null,null,null,null,null,null,null,null,null,null,null,null,null,null,null,null,null,null,null,null,null,null,null,null,null,null,null,null,null,null,null,null,null,null,"2010-08-21"]
[null,null,null,null,null,null,null,null,null,null,null,null,null,null,null,null,null,null,null,null,null,null,null,null,null,null,null,null,null,null,null,null,null,null,null,null,null,null,null,null,null,null,null,null,null,null,null,null,null,null,null,null,null,null,null,null,null,null,null,null,null,null,"2010-08-22"]
[null,null,null,null,null,null,null,null,null,null,null,null,null,null,null,null,null,null,null,null,null,null,null,null,null,null,null,null,null,null,null,null,null,null,null,null,null,null,null,null,null,null,null,null,null,null,null,null,null,null,null,null,null,null,null,null,null,null,null,null,null,null,"2010-08-23"]
[null,null,null,null,null,null,null,null,null,null,null,null,null,null,null,null,null,null,null,null,null,null,null,null,null,null,null,null,null,null,null,null,null,null,null,null,null,null,null,null,null,null,null,null,null,null,null,null,null,null,null,null,null,null,null,null,null,null,null,null,null,null,"2010-08-24"]
[null,null,null,null,null,null,null,null,null,null,null,null,null,null,null,null,null,null,null,null,null,null,null,null,null,null,null,null,null,null,null,null,null,null,null,null,null,null,null,null,null,null,null,null,null,null,null,null,null,null,null,null,null,null,null,null,null,null,null,null,null,null,"2010-08-25"]
[null,null,null,null,null,null,null,null,null,null,null,null,null,null,null,null,null,null,null,null,null,null,null,null,null,null,null,null,null,null,null,null,null,null,null,null,null,null,null,null,null,null,null,null,null,null,null,null,null,null,null,null,null,null,null,null,null,null,null,null,null,null,"2010-08-26"]
[null,null,null,null,null,null,null,null,null,null,null,null,null,null,null,null,null,null,null,null,null,null,null,null,null,null,null,null,null,null,null,null,null,null,null,null,null,null,null,null,null,null,null,null,null,null,null,null,null,null,null,null,null,null,null,null,null,null,null,null,null,null,"2010-08-27"]
[null,null,null,null,null,null,null,null,null,null,null,null,null,null,null,null,null,null,null,null,null,null,null,null,null,null,null,null,null,null,null,null,null,null,null,null,null,null,null,null,null,null,null,null,null,null,null,null,null,null,null,null,null,null,null,null,null,null,null,null,null,null,"2010-08-28"]
[null,null,null,null,null,null,null,null,null,null,null,null,null,null,null,null,null,null,null,null,null,null,null,null,null,null,null,null,null,null,null,null,null,null,null,null,null,null,null,null,null,null,null,null,null,null,null,null,null,null,null,null,null,null,null,null,null,null,null,null,null,null,"2010-08-29"]
[null,null,null,null,null,null,null,null,null,null,null,null,null,null,null,null,null,null,null,null,null,null,null,null,null,null,null,null,null,null,null,null,null,null,null,null,null,null,null,null,null,null,null,null,null,null,null,null,null,null,null,null,null,null,null,null,null,null,null,null,null,null,"2010-08-30"]
[null,null,null,null,null,null,null,null,null,null,null,null,null,null,null,null,null,null,null,null,null,null,null,null,null,null,null,null,null,null,null,null,null,null,null,null,null,null,null,null,null,null,null,null,null,null,null,null,null,null,null,null,null,null,null,null,null,null,null,null,null,null,"2010-08-31"]
[null,null,null,null,null,null,null,null,null,null,null,null,null,null,null,null,null,null,null,null,null,null,null,null,null,null,null,null,null,null,null,null,null,null,null,null,null,null,null,null,null,null,null,null,null,null,null,null,null,null,null,null,null,null,null,null,null,null,null,null,null,null,"2010-09-01"]
[null,null,null,null,null,null,null,null,null,null,null,null,null,null,null,null,null,null,null,null,null,null,null,null,null,null,null,null,null,null,null,null,null,null,null,null,null,null,null,null,null,null,null,null,null,null,null,null,null,null,null,null,null,null,null,null,null,null,null,null,null,null,"2010-09-02"]
[null,null,null,null,null,null,null,null,null,null,null,null,null,null,null,null,null,null,null,null,null,null,null,null,null,null,null,null,null,null,null,null,null,null,null,null,null,null,null,null,null,null,null,null,null,null,null,null,null,null,null,null,null,null,null,null,null,null,null,null,null,null,"2010-09-03"]
[null,null,null,null,null,null,null,null,null,null,null,null,null,null,null,null,null,null,null,null,null,null,null,null,null,null,null,null,null,null,null,null,null,null,null,null,null,null,null,null,null,null,null,null,null,null,null,null,null,null,null,null,null,null,null,null,null,null,null,null,null,null,"2010-09-04"]
[null,null,null,null,null,null,null,null,null,null,null,null,null,null,null,null,null,null,null,null,null,null,null,null,null,null,null,null,null,null,null,null,null,null,null,null,null,null,null,null,null,null,null,null,null,null,null,null,null,null,null,null,null,null,null,null,null,null,null,null,null,null,"2010-09-05"]
[null,null,null,null,null,null,null,null,null,null,null,null,null,null,null,null,null,null,null,null,null,null,null,null,null,null,null,null,null,null,null,null,null,null,null,null,null,null,null,null,null,null,null,null,null,null,null,null,null,null,null,null,null,null,null,null,null,null,null,null,null,null,"2010-09-06"]
[null,null,null,null,null,null,null,null,null,null,null,null,null,null,null,null,null,null,null,null,null,null,null,null,null,null,null,null,null,null,null,null,null,null,null,null,null,null,null,null,null,null,null,null,null,null,null,null,null,null,null,null,null,null,null,null,null,null,null,null,null,null,"2010-09-07"]
[null,null,null,null,null,null,null,null,null,null,null,null,null,null,null,null,null,null,null,null,null,null,null,null,null,null,null,null,null,null,null,null,null,null,null,null,null,null,null,null,null,null,null,null,null,null,null,null,null,null,null,null,null,null,null,null,null,null,null,null,null,null,"2010-09-08"]
[null,null,null,null,null,null,null,null,null,null,null,null,null,null,null,null,null,null,null,null,null,null,null,null,null,null,null,null,null,null,null,null,null,null,null,null,null,null,null,null,null,null,null,null,null,null,null,null,null,null,null,null,null,null,null,null,null,null,null,null,null,null,"2010-09-09"]
[null,null,null,null,null,null,null,null,null,null,null,null,null,null,null,null,null,null,null,null,null,null,null,null,null,null,null,null,null,null,null,null,null,null,null,null,null,null,null,null,null,null,null,null,null,null,null,null,null,null,null,null,null,null,null,null,null,null,null,null,null,null,"2010-09-10"]
[null,null,null,null,null,null,null,null,null,null,null,null,null,null,null,null,null,null,null,null,null,null,null,null,null,null,null,null,null,null,null,null,null,null,null,null,null,null,null,null,null,null,null,null,null,null,null,null,null,null,null,null,null,null,null,null,null,null,null,null,null,null,"2010-09-11"]
[null,null,null,null,null,null,null,null,null,null,null,null,null,null,null,null,null,null,null,null,null,null,null,null,null,null,null,null,null,null,null,null,null,null,null,null,null,null,null,null,null,null,null,null,null,null,null,null,null,null,null,null,null,null,null,null,null,null,null,null,null,null,"2010-09-12"]
[null,null,null,null,null,null,null,null,null,null,null,null,null,null,null,null,null,null,null,null,null,null,null,null,null,null,null,null,null,null,null,null,null,null,null,null,null,null,null,null,null,null,null,null,null,null,null,null,null,null,null,null,null,null,null,null,null,null,null,null,null,null,"2010-09-13"]
[null,null,null,null,null,null,null,null,null,null,null,null,null,null,null,null,null,null,null,null,null,null,null,null,null,null,null,null,null,null,null,null,null,null,null,null,null,null,null,null,null,null,null,null,null,null,null,null,null,null,null,null,null,null,null,null,null,null,null,null,null,null,"2010-09-14"]
[null,null,null,null,null,null,null,null,null,null,null,null,null,null,null,null,null,null,null,null,null,null,null,null,null,null,null,null,null,null,null,null,null,null,null,null,null,null,null,null,null,null,null,null,null,null,null,null,null,null,null,null,null,null,null,null,null,null,null,null,null,null,"2010-09-15"]
[null,null,null,null,null,null,null,null,null,null,null,null,null,null,null,null,null,null,null,null,null,null,null,null,null,null,null,null,null,null,null,null,null,null,null,null,null,null,null,null,null,null,null,null,null,null,null,null,null,null,null,null,null,null,null,null,null,null,null,null,null,null,"2010-09-16"]
[null,null,null,null,null,null,null,null,null,null,null,null,null,null,null,null,null,null,null,null,null,null,null,null,null,null,null,null,null,null,null,null,null,null,null,null,null,null,null,null,null,null,null,null,null,null,null,null,null,null,null,null,null,null,null,null,null,null,null,null,null,null,"2010-09-17"]
[null,null,null,null,null,null,null,null,null,null,null,null,null,null,null,null,null,null,null,null,null,null,null,null,null,null,null,null,null,null,null,null,null,null,null,null,null,null,null,null,null,null,null,null,null,null,null,null,null,null,null,null,null,null,null,null,null,null,null,null,null,null,"2010-09-18"]
[null,null,null,null,null,null,null,null,null,null,null,null,null,null,null,null,null,null,null,null,null,null,null,null,null,null,null,null,null,null,null,null,null,null,null,null,null,null,null,null,null,null,null,null,null,null,null,null,null,null,null,null,null,null,null,null,null,null,null,null,null,null,"2010-09-19"]
[null,null,null,null,null,null,null,null,null,null,null,null,null,null,null,null,null,null,null,null,null,null,null,null,null,null,null,null,null,null,null,null,null,null,null,null,null,null,null,null,null,null,null,null,null,null,null,null,null,null,null,null,null,null,null,null,null,null,null,null,null,null,"2010-09-20"]
[null,null,null,null,null,null,null,null,null,null,null,null,null,null,null,null,null,null,null,null,null,null,null,null,null,null,null,null,null,null,null,null,null,null,null,null,null,null,null,null,null,null,null,null,null,null,null,null,null,null,null,null,null,null,null,null,null,null,null,null,null,null,"2010-09-21"]
[null,null,null,null,null,null,null,null,null,null,null,null,null,null,null,null,null,null,null,null,null,null,null,null,null,null,null,null,null,null,null,null,null,null,null,null,null,null,null,null,null,null,null,null,null,null,null,null,null,null,null,null,null,null,null,null,null,null,null,null,null,null,"2010-09-22"]
[null,null,null,null,null,null,null,null,null,null,null,null,null,null,null,null,null,null,null,null,null,null,null,null,null,null,null,null,null,null,null,null,null,null,null,null,null,null,null,null,null,null,null,null,null,null,null,null,null,null,null,null,null,null,null,null,null,null,null,null,null,null,"2010-09-23"]
[null,null,null,null,null,null,null,null,null,null,null,null,null,null,null,null,null,null,null,null,null,null,null,null,null,null,null,null,null,null,null,null,null,null,null,null,null,null,null,null,null,null,null,null,null,null,null,null,null,null,null,null,null,null,null,null,null,null,null,null,null,null,"2010-09-24"]
[null,null,null,null,null,null,null,null,null,null,null,null,null,null,null,null,null,null,null,null,null,null,null,null,null,null,null,null,null,null,null,null,null,null,null,null,null,null,null,null,null,null,null,null,null,null,null,null,null,null,null,null,null,null,null,null,null,null,null,null,null,null,"2010-09-25"]
[null,null,null,null,null,null,null,null,null,null,null,null,null,null,null,null,null,null,null,null,null,null,null,null,null,null,null,null,null,null,null,null,null,null,null,null,null,null,null,null,null,null,null,null,null,null,null,null,null,null,null,null,null,null,null,null,null,null,null,null,null,null,"2010-09-26"]
[null,null,null,null,null,null,null,null,null,null,null,null,null,null,null,null,null,null,null,null,null,null,null,null,null,null,null,null,null,null,null,null,null,null,null,null,null,null,null,null,null,null,null,null,null,null,null,null,null,null,null,null,null,null,null,null,null,null,null,null,null,null,"2010-09-27"]
[null,null,null,null,null,null,null,null,null,null,null,null,null,null,null,null,null,null,null,null,null,null,null,null,null,null,null,null,null,null,null,null,null,null,null,null,null,null,null,null,null,null,null,null,null,null,null,null,null,null,null,null,null,null,null,null,null,null,null,null,null,null,"2010-09-28"]
[null,null,null,null,null,null,null,null,null,null,null,null,null,null,null,null,null,null,null,null,null,null,null,null,null,null,null,null,null,null,null,null,null,null,null,null,null,null,null,null,null,null,null,null,null,null,null,null,null,null,null,null,null,null,null,null,null,null,null,null,null,null,"2010-09-29"]
[null,null,null,null,null,null,null,null,null,null,null,null,null,null,null,null,null,null,null,null,null,null,null,null,null,null,null,null,null,null,null,null,null,null,null,null,null,null,null,null,null,null,null,null,null,null,null,null,null,null,null,null,null,null,null,null,null,null,null,null,null,null,"2010-09-30"]
[null,null,null,null,null,null,null,null,null,null,null,null,null,null,null,null,null,null,null,null,null,null,null,null,null,null,null,null,null,null,null,null,null,null,null,null,null,null,null,null,null,null,null,null,null,null,null,null,null,null,null,null,null,null,null,null,null,null,null,null,null,null,"2010-10-01"]
[null,null,null,null,null,null,null,null,null,null,null,null,null,null,null,null,null,null,null,null,null,null,null,null,null,null,null,null,null,null,null,null,null,null,null,null,null,null,null,null,null,null,null,null,null,null,null,null,null,null,null,null,null,null,null,null,null,null,null,null,null,null,"2010-10-02"]
[null,null,null,null,null,null,null,null,null,null,null,null,null,null,null,null,null,null,null,null,null,null,null,null,null,null,null,null,null,null,null,null,null,null,null,null,null,null,null,null,null,null,null,null,null,null,null,null,null,null,null,null,null,null,null,null,null,null,null,null,null,null,"2010-10-03"]
[null,null,null,null,null,null,null,null,null,null,null,null,null,null,null,null,null,null,null,null,null,null,null,null,null,null,null,null,null,null,null,null,null,null,null,null,null,null,null,null,null,null,null,null,null,null,null,null,null,null,null,null,null,null,null,null,null,null,null,null,null,null,"2010-10-04"]
[null,null,null,null,null,null,null,null,null,null,null,null,null,null,null,null,null,null,null,null,null,null,null,null,null,null,null,null,null,null,null,null,null,null,null,null,null,null,null,null,null,null,null,null,null,null,null,null,null,null,null,null,null,null,null,null,null,null,null,null,null,null,"2010-10-05"]
[null,null,null,null,null,null,null,null,null,null,null,null,null,null,null,null,null,null,null,null,null,null,null,null,null,null,null,null,null,null,null,null,null,null,null,null,null,null,null,null,null,null,null,null,null,null,null,null,null,null,null,null,null,null,null,null,null,null,null,null,null,null,"2010-10-06"]
[null,null,null,null,null,null,null,null,null,null,null,null,null,null,null,null,null,null,null,null,null,null,null,null,null,null,null,null,null,null,null,null,null,null,null,null,null,null,null,null,null,null,null,null,null,null,null,null,null,null,null,null,null,null,null,null,null,null,null,null,null,null,"2010-10-07"]
[null,null,null,null,null,null,null,null,null,null,null,null,null,null,null,null,null,null,null,null,null,null,null,null,null,null,null,null,null,null,null,null,null,null,null,null,null,null,null,null,null,null,null,null,null,null,null,null,null,null,null,null,null,null,null,null,null,null,null,null,null,null,"2010-10-08"]
[null,null,null,null,null,null,null,null,null,null,null,null,null,null,null,null,null,null,null,null,null,null,null,null,null,null,null,null,null,null,null,null,null,null,null,null,null,null,null,null,null,null,null,null,null,null,null,null,null,null,null,null,null,null,null,null,null,null,null,null,null,null,"2010-10-09"]
[null,null,null,null,null,null,null,null,null,null,null,null,null,null,null,null,null,null,null,null,null,null,null,null,null,null,null,null,null,null,null,null,null,null,null,null,null,null,null,null,null,null,null,null,null,null,null,null,null,null,null,null,null,null,null,null,null,null,null,null,null,null,"2010-10-10"]
[null,null,null,null,null,null,null,null,null,null,null,null,null,null,null,null,null,null,null,null,null,null,null,null,null,null,null,null,null,null,null,null,null,null,null,null,null,null,null,null,null,null,null,null,null,null,null,null,null,null,null,null,null,null,null,null,null,null,null,null,null,null,"2010-10-11"]
[null,null,null,null,null,null,null,null,null,null,null,null,null,null,null,null,null,null,null,null,null,null,null,null,null,null,null,null,null,null,null,null,null,null,null,null,null,null,null,null,null,null,null,null,null,null,null,null,null,null,null,null,null,null,null,null,null,null,null,null,null,null,"2010-10-12"]
[null,null,null,null,null,null,null,null,null,null,null,null,null,null,null,null,null,null,null,null,null,null,null,null,null,null,null,null,null,null,null,null,null,null,null,null,null,null,null,null,null,null,null,null,null,null,null,null,null,null,null,null,null,null,null,null,null,null,null,null,null,null,"2010-10-13"]
[null,null,null,null,null,null,null,null,null,null,null,null,null,null,null,null,null,null,null,null,null,null,null,null,null,null,null,null,null,null,null,null,null,null,null,null,null,null,null,null,null,null,null,null,null,null,null,null,null,null,null,null,null,null,null,null,null,null,null,null,null,null,"2010-10-14"]
[null,null,null,null,null,null,null,null,null,null,null,null,null,null,null,null,null,null,null,null,null,null,null,null,null,null,null,null,null,null,null,null,null,null,null,null,null,null,null,null,null,null,null,null,null,null,null,null,null,null,null,null,null,null,null,null,null,null,null,null,null,null,"2010-10-15"]
[null,null,null,null,null,null,null,null,null,null,null,null,null,null,null,null,null,null,null,null,null,null,null,null,null,null,null,null,null,null,null,null,null,null,null,null,null,null,null,null,null,null,null,null,null,null,null,null,null,null,null,null,null,null,null,null,null,null,null,null,null,null,"2010-10-16"]
[null,null,null,null,null,null,null,null,null,null,null,null,null,null,null,null,null,null,null,null,null,null,null,null,null,null,null,null,null,null,null,null,null,null,null,null,null,null,null,null,null,null,null,null,null,null,null,null,null,null,null,null,null,null,null,null,null,null,null,null,null,null,"2010-10-17"]
[null,null,null,null,null,null,null,null,null,null,null,null,null,null,null,null,null,null,null,null,null,null,null,null,null,null,null,null,null,null,null,null,null,null,null,null,null,null,null,null,null,null,null,null,null,null,null,null,null,null,null,null,null,null,null,null,null,null,null,null,null,null,"2010-10-18"]
[null,null,null,null,null,null,null,null,null,null,null,null,null,null,null,null,null,null,null,null,null,null,null,null,null,null,null,null,null,null,null,null,null,null,null,null,null,null,null,null,null,null,null,null,null,null,null,null,null,null,null,null,null,null,null,null,null,null,null,null,null,null,"2010-10-19"]
[null,null,null,null,null,null,null,null,null,null,null,null,null,null,null,null,null,null,null,null,null,null,null,null,null,null,null,null,null,null,null,null,null,null,null,null,null,null,null,null,null,null,null,null,null,null,null,null,null,null,null,null,null,null,null,null,null,null,null,null,null,null,"2010-10-20"]
[null,null,null,null,null,null,null,null,null,null,null,null,null,null,null,null,null,null,null,null,null,null,null,null,null,null,null,null,null,null,null,null,null,null,null,null,null,null,null,null,null,null,null,null,null,null,null,null,null,null,null,null,null,null,null,null,null,null,null,null,null,null,"2010-10-21"]
[null,null,null,null,null,null,null,null,null,null,null,null,null,null,null,null,null,null,null,null,null,null,null,null,null,null,null,null,null,null,null,null,null,null,null,null,null,null,null,null,null,null,null,null,null,null,null,null,null,null,null,null,null,null,null,null,null,null,null,null,null,null,"2010-10-22"]
[null,null,null,null,null,null,null,null,null,null,null,null,null,null,null,null,null,null,null,null,null,null,null,null,null,null,null,null,null,null,null,null,null,null,null,null,null,null,null,null,null,null,null,null,null,null,null,null,null,null,null,null,null,null,null,null,null,null,null,null,null,null,"2010-10-23"]
[null,null,null,null,null,null,null,null,null,null,null,null,null,null,null,null,null,null,null,null,null,null,null,null,null,null,null,null,null,null,null,null,null,null,null,null,null,null,null,null,null,null,null,null,null,null,null,null,null,null,null,null,null,null,null,null,null,null,null,null,null,null,"2010-10-24"]
[null,null,null,null,null,null,null,null,null,null,null,null,null,null,null,null,null,null,null,null,null,null,null,null,null,null,null,null,null,null,null,null,null,null,null,null,null,null,null,null,null,null,null,null,null,null,null,null,null,null,null,null,null,null,null,null,null,null,null,null,null,null,"2010-10-25"]
[null,null,null,null,null,null,null,null,null,null,null,null,null,null,null,null,null,null,null,null,null,null,null,null,null,null,null,null,null,null,null,null,null,null,null,null,null,null,null,null,null,null,null,null,null,null,null,null,null,null,null,null,null,null,null,null,null,null,null,null,null,null,"2010-10-26"]
[null,null,null,null,null,null,null,null,null,null,null,null,null,null,null,null,null,null,null,null,null,null,null,null,null,null,null,null,null,null,null,null,null,null,null,null,null,null,null,null,null,null,null,null,null,null,null,null,null,null,null,null,null,null,null,null,null,null,null,null,null,null,"2010-10-27"]
[null,null,null,null,null,null,null,null,null,null,null,null,null,null,null,null,null,null,null,null,null,null,null,null,null,null,null,null,null,null,null,null,null,null,null,null,null,null,null,null,null,null,null,null,null,null,null,null,null,null,null,null,null,null,null,null,null,null,null,null,null,null,"2010-10-28"]
[null,null,null,null,null,null,null,null,null,null,null,null,null,null,null,null,null,null,null,null,null,null,null,null,null,null,null,null,null,null,null,null,null,null,null,null,null,null,null,null,null,null,null,null,null,null,null,null,null,null,null,null,null,null,null,null,null,null,null,null,null,null,"2010-10-29"]
[null,null,null,null,null,null,null,null,null,null,null,null,null,null,null,null,null,null,null,null,null,null,null,null,null,null,null,null,null,null,null,null,null,null,null,null,null,null,null,null,null,null,null,null,null,null,null,null,null,null,null,null,null,null,null,null,null,null,null,null,null,null,"2010-10-30"]
[null,null,null,null,null,null,null,null,null,null,null,null,null,null,null,null,null,null,null,null,null,null,null,null,null,null,null,null,null,null,null,null,null,null,null,null,null,null,null,null,null,null,null,null,null,null,null,null,null,null,null,null,null,null,null,null,null,null,null,null,null,null,"2010-10-31"]
[null,null,null,null,null,null,null,null,null,null,null,null,null,null,null,null,null,null,null,null,null,null,null,null,null,null,null,null,null,null,null,null,null,null,null,null,null,null,null,null,null,null,null,null,null,null,null,null,null,null,null,null,null,null,null,null,null,null,null,null,null,null,"2010-11-01"]
[null,null,null,null,null,null,null,null,null,null,null,null,null,null,null,null,null,null,null,null,null,null,null,null,null,null,null,null,null,null,null,null,null,null,null,null,null,null,null,null,null,null,null,null,null,null,null,null,null,null,null,null,null,null,null,null,null,null,null,null,null,null,"2010-11-02"]
[null,null,null,null,null,null,null,null,null,null,null,null,null,null,null,null,null,null,null,null,null,null,null,null,null,null,null,null,null,null,null,null,null,null,null,null,null,null,null,null,null,null,null,null,null,null,null,null,null,null,null,null,null,null,null,null,null,null,null,null,null,null,"2010-11-03"]
[null,null,null,null,null,null,null,null,null,null,null,null,null,null,null,null,null,null,null,null,null,null,null,null,null,null,null,null,null,null,null,null,null,null,null,null,null,null,null,null,null,null,null,null,null,null,null,null,null,null,null,null,null,null,null,null,null,null,null,null,null,null,"2010-11-04"]
[null,null,null,null,null,null,null,null,null,null,null,null,null,null,null,null,null,null,null,null,null,null,null,null,null,null,null,null,null,null,null,null,null,null,null,null,null,null,null,null,null,null,null,null,null,null,null,null,null,null,null,null,null,null,null,null,null,null,null,null,null,null,"2010-11-05"]
[null,null,null,null,null,null,null,null,null,null,null,null,null,null,null,null,null,null,null,null,null,null,null,null,null,null,null,null,null,null,null,null,null,null,null,null,null,null,null,null,null,null,null,null,null,null,null,null,null,null,null,null,null,null,null,null,null,null,null,null,null,null,"2010-11-06"]
[null,null,null,null,null,null,null,null,null,null,null,null,null,null,null,null,null,null,null,null,null,null,null,null,null,null,null,null,null,null,null,null,null,null,null,null,null,null,null,null,null,null,null,null,null,null,null,null,null,null,null,null,null,null,null,null,null,null,null,null,null,null,"2010-11-07"]
[null,null,null,null,null,null,null,null,null,null,null,null,null,null,null,null,null,null,null,null,null,null,null,null,null,null,null,null,null,null,null,null,null,null,null,null,null,null,null,null,null,null,null,null,null,null,null,null,null,null,null,null,null,null,null,null,null,null,null,null,null,null,"2010-11-08"]
[null,null,null,null,null,null,null,null,null,null,null,null,null,null,null,null,null,null,null,null,null,null,null,null,null,null,null,null,null,null,null,null,null,null,null,null,null,null,null,null,null,null,null,null,null,null,null,null,null,null,null,null,null,null,null,null,null,null,null,null,null,null,"2010-11-09"]
[null,null,null,null,null,null,null,null,null,null,null,null,null,null,null,null,null,null,null,null,null,null,null,null,null,null,null,null,null,null,null,null,null,null,null,null,null,null,null,null,null,null,null,null,null,null,null,null,null,null,null,null,null,null,null,null,null,null,null,null,null,null,"2010-11-10"]
[null,null,null,null,null,null,null,null,null,null,null,null,null,null,null,null,null,null,null,null,null,null,null,null,null,null,null,null,null,null,null,null,null,null,null,null,null,null,null,null,null,null,null,null,null,null,null,null,null,null,null,null,null,null,null,null,null,null,null,null,null,null,"2010-11-11"]
[null,null,null,null,null,null,null,null,null,null,null,null,null,null,null,null,null,null,null,null,null,null,null,null,null,null,null,null,null,null,null,null,null,null,null,null,null,null,null,null,null,null,null,null,null,null,null,null,null,null,null,null,null,null,null,null,null,null,null,null,null,null,"2010-11-12"]
[null,null,null,null,null,null,null,null,null,null,null,null,null,null,null,null,null,null,null,null,null,null,null,null,null,null,null,null,null,null,null,null,null,null,null,null,null,null,null,null,null,null,null,null,null,null,null,null,null,null,null,null,null,null,null,null,null,null,null,null,null,null,"2010-11-13"]
[null,null,null,null,null,null,null,null,null,null,null,null,null,null,null,null,null,null,null,null,null,null,null,null,null,null,null,null,null,null,null,null,null,null,null,null,null,null,null,null,null,null,null,null,null,null,null,null,null,null,null,null,null,null,null,null,null,null,null,null,null,null,"2010-11-14"]
[null,null,null,null,null,null,null,null,null,null,null,null,null,null,null,null,null,null,null,null,null,null,null,null,null,null,null,null,null,null,null,null,null,null,null,null,null,null,null,null,null,null,null,null,null,null,null,null,null,null,null,null,null,null,null,null,null,null,null,null,null,null,"2010-11-15"]
[null,null,null,null,null,null,null,null,null,null,null,null,null,null,null,null,null,null,null,null,null,null,null,null,null,null,null,null,null,null,null,null,null,null,null,null,null,null,null,null,null,null,null,null,null,null,null,null,null,null,null,null,null,null,null,null,null,null,null,null,null,null,"2010-11-16"]
[null,null,null,null,null,null,null,null,null,null,null,null,null,null,null,null,null,null,null,null,null,null,null,null,null,null,null,null,null,null,null,null,null,null,null,null,null,null,null,null,null,null,null,null,null,null,null,null,null,null,null,null,null,null,null,null,null,null,null,null,null,null,"2010-11-17"]
[null,null,null,null,null,null,null,null,null,null,null,null,null,null,null,null,null,null,null,null,null,null,null,null,null,null,null,null,null,null,null,null,null,null,null,null,null,null,null,null,null,null,null,null,null,null,null,null,null,null,null,null,null,null,null,null,null,null,null,null,null,null,"2010-11-18"]
[null,null,null,null,null,null,null,null,null,null,null,null,null,null,null,null,null,null,null,null,null,null,null,null,null,null,null,null,null,null,null,null,null,null,null,null,null,null,null,null,null,null,null,null,null,null,null,null,null,null,null,null,null,null,null,null,null,null,null,null,null,null,"2010-11-19"]
[null,null,null,null,null,null,null,null,null,null,null,null,null,null,null,null,null,null,null,null,null,null,null,null,null,null,null,null,null,null,null,null,null,null,null,null,null,null,null,null,null,null,null,null,null,null,null,null,null,null,null,null,null,null,null,null,null,null,null,null,null,null,"2010-11-20"]
[null,null,null,null,null,null,null,null,null,null,null,null,null,null,null,null,null,null,null,null,null,null,null,null,null,null,null,null,null,null,null,null,null,null,null,null,null,null,null,null,null,null,null,null,null,null,null,null,null,null,null,null,null,null,null,null,null,null,null,null,null,null,"2010-11-21"]
[null,null,null,null,null,null,null,null,null,null,null,null,null,null,null,null,null,null,null,null,null,null,null,null,null,null,null,null,null,null,null,null,null,null,null,null,null,null,null,null,null,null,null,null,null,null,null,null,null,null,null,null,null,null,null,null,null,null,null,null,null,null,"2010-11-22"]
[null,null,null,null,null,null,null,null,null,null,null,null,null,null,null,null,null,null,null,null,null,null,null,null,null,null,null,null,null,null,null,null,null,null,null,null,null,null,null,null,null,null,null,null,null,null,null,null,null,null,null,null,null,null,null,null,null,null,null,null,null,null,"2010-11-23"]
[null,null,null,null,null,null,null,null,null,null,null,null,null,null,null,null,null,null,null,null,null,null,null,null,null,null,null,null,null,null,null,null,null,null,null,null,null,null,null,null,null,null,null,null,null,null,null,null,null,null,null,null,null,null,null,null,null,null,null,null,null,null,"2010-11-24"]
[null,null,null,null,null,null,null,null,null,null,null,null,null,null,null,null,null,null,null,null,null,null,null,null,null,null,null,null,null,null,null,null,null,null,null,null,null,null,null,null,null,null,null,null,null,null,null,null,null,null,null,null,null,null,null,null,null,null,null,null,null,null,"2010-11-25"]
[null,null,null,null,null,null,null,null,null,null,null,null,null,null,null,null,null,null,null,null,null,null,null,null,null,null,null,null,null,null,null,null,null,null,null,null,null,null,null,null,null,null,null,null,null,null,null,null,null,null,null,null,null,null,null,null,null,null,null,null,null,null,"2010-11-26"]
[null,null,null,null,null,null,null,null,null,null,null,null,null,null,null,null,null,null,null,null,null,null,null,null,null,null,null,null,null,null,null,null,null,null,null,null,null,null,null,null,null,null,null,null,null,null,null,null,null,null,null,null,null,null,null,null,null,null,null,null,null,null,"2010-11-27"]
[null,null,null,null,null,null,null,null,null,null,null,null,null,null,null,null,null,null,null,null,null,null,null,null,null,null,null,null,null,null,null,null,null,null,null,null,null,null,null,null,null,null,null,null,null,null,null,null,null,null,null,null,null,null,null,null,null,null,null,null,null,null,"2010-11-28"]
[null,null,null,null,null,null,null,null,null,null,null,null,null,null,null,null,null,null,null,null,null,null,null,null,null,null,null,null,null,null,null,null,null,null,null,null,null,null,null,null,null,null,null,null,null,null,null,null,null,null,null,null,null,null,null,null,null,null,null,null,null,null,"2010-11-29"]
[null,null,null,null,null,null,null,null,null,null,null,null,null,null,null,null,null,null,null,null,null,null,null,null,null,null,null,null,null,null,null,null,null,null,null,null,null,null,null,null,null,null,null,null,null,null,null,null,null,null,null,null,null,null,null,null,null,null,null,null,null,null,"2010-11-30"]
[null,null,null,null,null,null,null,null,null,null,null,null,null,null,null,null,null,null,null,null,null,null,null,null,null,null,null,null,null,null,null,null,null,null,null,null,null,null,null,null,null,null,null,null,null,null,null,null,null,null,null,null,null,null,null,null,null,null,null,null,null,null,"2010-12-01"]
[null,null,null,null,null,null,null,null,null,null,null,null,null,null,null,null,null,null,null,null,null,null,null,null,null,null,null,null,null,null,null,null,null,null,null,null,null,null,null,null,null,null,null,null,null,null,null,null,null,null,null,null,null,null,null,null,null,null,null,null,null,null,"2010-12-02"]
[null,null,null,null,null,null,null,null,null,null,null,null,null,null,null,null,null,null,null,null,null,null,null,null,null,null,null,null,null,null,null,null,null,null,null,null,null,null,null,null,null,null,null,null,null,null,null,null,null,null,null,null,null,null,null,null,null,null,null,null,null,null,"2010-12-03"]
[null,null,null,null,null,null,null,null,null,null,null,null,null,null,null,null,null,null,null,null,null,null,null,null,null,null,null,null,null,null,null,null,null,null,null,null,null,null,null,null,null,null,null,null,null,null,null,null,null,null,null,null,null,null,null,null,null,null,null,null,null,null,"2010-12-04"]
[null,null,null,null,null,null,null,null,null,null,null,null,null,null,null,null,null,null,null,null,null,null,null,null,null,null,null,null,null,null,null,null,null,null,null,null,null,null,null,null,null,null,null,null,null,null,null,null,null,null,null,null,null,null,null,null,null,null,null,null,null,null,"2010-12-05"]
[null,null,null,null,null,null,null,null,null,null,null,null,null,null,null,null,null,null,null,null,null,null,null,null,null,null,null,null,null,null,null,null,null,null,null,null,null,null,null,null,null,null,null,null,null,null,null,null,null,null,null,null,null,null,null,null,null,null,null,null,null,null,"2010-12-06"]
[null,null,null,null,null,null,null,null,null,null,null,null,null,null,null,null,null,null,null,null,null,null,null,null,null,null,null,null,null,null,null,null,null,null,null,null,null,null,null,null,null,null,null,null,null,null,null,null,null,null,null,null,null,null,null,null,null,null,null,null,null,null,"2010-12-07"]
[null,null,null,null,null,null,null,null,null,null,null,null,null,null,null,null,null,null,null,null,null,null,null,null,null,null,null,null,null,null,null,null,null,null,null,null,null,null,null,null,null,null,null,null,null,null,null,null,null,null,null,null,null,null,null,null,null,null,null,null,null,null,"2010-12-08"]
[null,null,null,null,null,null,null,null,null,null,null,null,null,null,null,null,null,null,null,null,null,null,null,null,null,null,null,null,null,null,null,null,null,null,null,null,null,null,null,null,null,null,null,null,null,null,null,null,null,null,null,null,null,null,null,null,null,null,null,null,null,null,"2010-12-09"]
[null,null,null,null,null,null,null,null,null,null,null,null,null,null,null,null,null,null,null,null,null,null,null,null,null,null,null,null,null,null,null,null,null,null,null,null,null,null,null,null,null,null,null,null,null,null,null,null,null,null,null,null,null,null,null,null,null,null,null,null,null,null,"2010-12-10"]
[null,null,null,null,null,null,null,null,null,null,null,null,null,null,null,null,null,null,null,null,null,null,null,null,null,null,null,null,null,null,null,null,null,null,null,null,null,null,null,null,null,null,null,null,null,null,null,null,null,null,null,null,null,null,null,null,null,null,null,null,null,null,"2010-12-11"]
[null,null,null,null,null,null,null,null,null,null,null,null,null,null,null,null,null,null,null,null,null,null,null,null,null,null,null,null,null,null,null,null,null,null,null,null,null,null,null,null,null,null,null,null,null,null,null,null,null,null,null,null,null,null,null,null,null,null,null,null,null,null,"2010-12-12"]
[null,null,null,null,null,null,null,null,null,null,null,null,null,null,null,null,null,null,null,null,null,null,null,null,null,null,null,null,null,null,null,null,null,null,null,null,null,null,null,null,null,null,null,null,null,null,null,null,null,null,null,null,null,null,null,null,null,null,null,null,null,null,"2010-12-13"]
[null,null,null,null,null,null,null,null,null,null,null,null,null,null,null,null,null,null,null,null,null,null,null,null,null,null,null,null,null,null,null,null,null,null,null,null,null,null,null,null,null,null,null,null,null,null,null,null,null,null,null,null,null,null,null,null,null,null,null,null,null,null,"2010-12-14"]
[null,null,null,null,null,null,null,null,null,null,null,null,null,null,null,null,null,null,null,null,null,null,null,null,null,null,null,null,null,null,null,null,null,null,null,null,null,null,null,null,null,null,null,null,null,null,null,null,null,null,null,null,null,null,null,null,null,null,null,null,null,null,"2010-12-15"]
[null,null,null,null,null,null,null,null,null,null,null,null,null,null,null,null,null,null,null,null,null,null,null,null,null,null,null,null,null,null,null,null,null,null,null,null,null,null,null,null,null,null,null,null,null,null,null,null,null,null,null,null,null,null,null,null,null,null,null,null,null,null,"2010-12-16"]
[null,null,null,null,null,null,null,null,null,null,null,null,null,null,null,null,null,null,null,null,null,null,null,null,null,null,null,null,null,null,null,null,null,null,null,null,null,null,null,null,null,null,null,null,null,null,null,null,null,null,null,null,null,null,null,null,null,null,null,null,null,null,"2010-12-17"]
[null,null,null,null,null,null,null,null,null,null,null,null,null,null,null,null,null,null,null,null,null,null,null,null,null,null,null,null,null,null,null,null,null,null,null,null,null,null,null,null,null,null,null,null,null,null,null,null,null,null,null,null,null,null,null,null,null,null,null,null,null,null,"2010-12-18"]
[null,null,null,null,null,null,null,null,null,null,null,null,null,null,null,null,null,null,null,null,null,null,null,null,null,null,null,null,null,null,null,null,null,null,null,null,null,null,null,null,null,null,null,null,null,null,null,null,null,null,null,null,null,null,null,null,null,null,null,null,null,null,"2010-12-19"]
[null,null,null,null,null,null,null,null,null,null,null,null,null,null,null,null,null,null,null,null,null,null,null,null,null,null,null,null,null,null,null,null,null,null,null,null,null,null,null,null,null,null,null,null,null,null,null,null,null,null,null,null,null,null,null,null,null,null,null,null,null,null,"2010-12-20"]
[null,null,null,null,null,null,null,null,null,null,null,null,null,null,null,null,null,null,null,null,null,null,null,null,null,null,null,null,null,null,null,null,null,null,null,null,null,null,null,null,null,null,null,null,null,null,null,null,null,null,null,null,null,null,null,null,null,null,null,null,null,null,"2010-12-21"]
[null,null,null,null,null,null,null,null,null,null,null,null,null,null,null,null,null,null,null,null,null,null,null,null,null,null,null,null,null,null,null,null,null,null,null,null,null,null,null,null,null,null,null,null,null,null,null,null,null,null,null,null,null,null,null,null,null,null,null,null,null,null,"2010-12-22"]
[null,null,null,null,null,null,null,null,null,null,null,null,null,null,null,null,null,null,null,null,null,null,null,null,null,null,null,null,null,null,null,null,null,null,null,null,null,null,null,null,null,null,null,null,null,null,null,null,null,null,null,null,null,null,null,null,null,null,null,null,null,null,"2010-12-23"]
[null,null,null,null,null,null,null,null,null,null,null,null,null,null,null,null,null,null,null,null,null,null,null,null,null,null,null,null,null,null,null,null,null,null,null,null,null,null,null,null,null,null,null,null,null,null,null,null,null,null,null,null,null,null,null,null,null,null,null,null,null,null,"2010-12-24"]
[null,null,null,null,null,null,null,null,null,null,null,null,null,null,null,null,null,null,null,null,null,null,null,null,null,null,null,null,null,null,null,null,null,null,null,null,null,null,null,null,null,null,null,null,null,null,null,null,null,null,null,null,null,null,null,null,null,null,null,null,null,null,"2010-12-25"]
[null,null,null,null,null,null,null,null,null,null,null,null,null,null,null,null,null,null,null,null,null,null,null,null,null,null,null,null,null,null,null,null,null,null,null,null,null,null,null,null,null,null,null,null,null,null,null,null,null,null,null,null,null,null,null,null,null,null,null,null,null,null,"2010-12-26"]
[null,null,null,null,null,null,null,null,null,null,null,null,null,null,null,null,null,null,null,null,null,null,null,null,null,null,null,null,null,null,null,null,null,null,null,null,null,null,null,null,null,null,null,null,null,null,null,null,null,null,null,null,null,null,null,null,null,null,null,null,null,null,"2010-12-27"]
[null,null,null,null,null,null,null,null,null,null,null,null,null,null,null,null,null,null,null,null,null,null,null,null,null,null,null,null,null,null,null,null,null,null,null,null,null,null,null,null,null,null,null,null,null,null,null,null,null,null,null,null,null,null,null,null,null,null,null,null,null,null,"2010-12-28"]
[null,null,null,null,null,null,null,null,null,null,null,null,null,null,null,null,null,null,null,null,null,null,null,null,null,null,null,null,null,null,null,null,null,null,null,null,null,null,null,null,null,null,null,null,null,null,null,null,null,null,null,null,null,null,null,null,null,null,null,null,null,null,"2010-12-29"]
[null,null,null,null,null,null,null,null,null,null,null,null,null,null,null,null,null,null,null,null,null,null,null,null,null,null,null,null,null,null,null,null,null,null,null,null,null,null,null,null,null,null,null,null,null,null,null,null,null,null,null,null,null,null,null,null,null,null,null,null,null,null,"2010-12-30"]
[null,null,null,null,null,null,null,null,null,null,null,null,null,null,null,null,null,null,null,null,null,null,null,null,null,null,null,null,null,null,null,null,null,null,null,null,null,null,null,null,null,null,null,null,null,null,null,null,null,null,null,null,null,null,null,null,null,null,null,null,null,null,"2010-12-31"]

{"sheet":"P. TOKEN","index":2,"n_rows":33,"n_cols":15,"rows_kept":33,"cut":false,"hidden":false,"merged":[[0,0,0,14],[1,0,1,14],[4,9,4,14],[6,1,6,4],[6,11,6,14],[8,1,8,4],[8,10,8,14],[16,12,17,12],[13,1,13,4],[13,6,13,7],[13,9,13,11],[13,13,13,14],[15,1,15,2],[15,6,15,8],[15,11,15,13],[16,1,17,2],[16,3,16,4],[16,5,17,5],[16,6,16,10],[16,11,17,11],[19,3,19,5],[19,6,19,8],[22,1,22,6],[19,12,19,14],[19,9,19,11],[33,12,33,13],[5,1,5,4],[10,8,10,14],[25,0,25,3],[30,4,30,6],[30,11,30,14],[31,0,32,0],[32,12,32,13],[21,1,21,14],[16,13,17,13],[22,10,22,14],[23,0,23,3],[16,14,17,14],[17,3,17,4],[17,6,17,10],[19,1,19,2]]}
["A.P. STATE GOVERNMENT"]
["PAPER TOKEN"]
[]
[]
["STO Code:",{"$f":"'47-FRONT'!F7","v":0},{"$f":"'47-FRONT'!G7","v":7},{"$f":"'47-FRONT'!H7","v":0},{"$f":"'47-FRONT'!I7","v":5},null,null,null,null,"(For Treasury Use Only)"]
["STO Name:",{"$f":"'WORK SHEET'!E18","v":"STO;DARSI"},null,null,null,null,null,null,null,"Date:……………………"]
["DDO Code:",{"$f":"CONCATENATE('47-FRONT'!F10,'47-FRONT'!G10,'47-FRONT'!H10,'47-FRONT'!I10,'47-FRONT'!J10,'47-FRONT'!K10,'47-FRONT'!L10,'47-FRONT'!M10,'47-FRONT'!N10,'47-FRONT'!O10,'47-FRONT'!P10)","v":"07050308026"},null,null,null,null,null,null,null,"Trans ID:"]
[]
["DDO Designation:",{"$f":"IF('47-FRONT'!F12=\"MANDAL EDUCATIONAL OFFICER\",\"M.E.O.\",'47-FRONT'!F12)","v":"M.E.O."},null,null,null,null,"DDO Office Name:",null,null,null,{"$f":"'47-FRONT'!R12","v":"MRC, KURICHEDU"}]
[]
["Bank Branch Code:",{"$f":"'47-FRONT'!F15","v":3},{"$f":"'47-FRONT'!G15","v":6},{"$f":"'47-FRONT'!H15","v":4},{"$f":"'47-FRONT'!I15","v":1},null,"Name:",null,{"$f":"'47-FRONT'!R15","v":"SYNDICATE BANK DARSI"}]
[]
["Head of Account:",{"$f":"'47-FRONT'!E24","v":2},{"$f":"'47-FRONT'!F24","v":2},{"$f":"'47-FRONT'!G24","v":0},{"$f":"'47-FRONT'!H24","v":2},null,{"$f":"'47-FRONT'!E26","v":0},{"$f":"'47-FRONT'!F26","v":1},null,{"$f":"'47-FRONT'!E28","v":1},{"$f":"'47-FRONT'!F28","v":0},{"$f":"'47-FRONT'!G28","v":3}]
[null,"(Major Head)",null,null,null,null,"(Sub-MH)",null,null,"(Minor Head)",null,null,null,"(Grp-SH)"]
[null,{"$f":"'47-FRONT'!E32","v":0},{"$f":"'47-FRONT'!F32","v":5},null,null,null,{"$f":"'47-FRONT'!E34","v":0},{"$f":"'47-FRONT'!F34","v":1},{"$f":"'47-FRONT'!G34","v":0}]
[null,"(Sub-Head)",null,null,null,null,"(Det.Head)",null,null,null,null,"(Sub Det.Head)"]
["Non-Plan=N/","N",null,"Charged=C/",null,"V","Contingency Fund MH/",null,null,null,null,{"$f":"B13","v":2},{"$f":"C13","v":2},{"$f":"D13","v":0},{"$f":"E13","v":2}]
["Plan=P:",null,null,"Voted=V",null,null,"Service Major Head"]
[]
["GROSS Rs",{"$f":"BILL!AH27+BILL!AH38","v":10198},null,"Deductions Rs",null,null,{"$f":"BILL!AH27","v":9004},null,null,"Net Rs",null,null,{"$f":"BILL!AH38","v":1194}]
[]
["NET",{"$f":"'BILL-P.F & CASH'!A41","v":"RUPEES : ONE THOUSAND ONE HUNDRED AND NINETY FOUR  ONLY"}]
["Messenger Name:",{"$f":"'WORK SHEET'!E21","v":"J.V.V.M.SUDHAKAR"},null,null,null,null,null,"Designation :",null,null,{"$f":"'WORK SHEET'!E22","v":"M.R.P"}]
["(As in APTC form-101)"]
[]
["Specimen Signature of Messenger",null,null,null,1]
[null,null,null,null,2]
[]
[]
[]
["DDO Signature",null,null,null,"Attested",null,null,null,null,null,null,"STO Signature"]
[]
[null,null,null,null,"DDOSignature"]

{"sheet":"ANNEX-I & II","index":3,"n_rows":17,"n_cols":16,"rows_kept":17,"cut":false,"hidden":false,"merged":[[5,2,5,4],[4,10,4,11],[7,9,7,11],[7,2,7,4],[8,9,8,11],[5,10,5,11],[0,0,0,6],[1,0,1,6],[2,0,2,6],[4,2,4,3],[3,2,3,4],[18,0,18,15],[16,8,16,9],[16,14,16,15],[12,9,12,11],[12,12,12,14],[14,8,14,15],[13,8,13,15],[0,8,0,15],[1,8,1,15],[2,8,2,15],[3,10,3,12],[11,9,11,11],[4,12,4,13],[10,9,10,11],[9,9,9,11],[8,12,11,14],[7,12,7,14],[9,2,9,4],[14,0,14,2],[8,2,8,3],[15,0,15,2],[10,0,10,6],[14,5,14,6],[15,5,15,6],[11,0,11,6]]}
["ANNEXURE - I",null,null,null,null,null,null,null,"ANNEXURE - II"]
["(Employ wise details)",null,null,null,null,null,null,null,"(Notified Link Bank Report)"]
["To be furnished by the DDO in triplicate along with the bill",null,null,null,null,null,null,null,"To be furnished by the DDO in triplicate"]
["Name of the NPB:      S.B.I.       ADDANKI",null,{"$f":"'P. TOKEN'!I11","v":"SYNDICATE BANK DARSI"},null,null,null,null,null,"DDO Code              :",null,{"$f":"C5","v":"07050308026"}]
["DDO CODE        :                        ",null,{"$f":"'P. TOKEN'!B7","v":"07050308026"},null,null,"              Date  :",null,null,"DDO Name & Desig:                  ",null,{"$f":"'WORK SHEET'!E16","v":"N.vijayakumar"},null,{"$f":"'ANNEX-I & II'!C6","v":"M.E.O."},null,"Date"]
["DDO  Desig        :                        ",null,{"$f":"'P. TOKEN'!B9","v":"M.E.O."},null,null,"Trance ID No :",null,null,"Name of NLB          : ",null,{"$f":"'WORK SHEET'!E18","v":"STO;DARSI"},null,null,null,"Trans ID No:"]
[]
["Sl.No","Employee Code","Employee Name",null,null,"Employee Account No.","Amount to be cerdited",null,"Sl.No","Name of the NPB",null,null,"Purpose",null,null,"Ammount to be credited"]
[1,{"$f":"'WORK SHEET'!E7","v":724731},{"$f":"'BILL-NOTIONAL'!C5","v":"SK.KHAJARAHAMTULLA"},null,{"$f":"IF('WORK SHEET'!E41='WORK SHEET'!O106,'WORK SHEET'!E44,'WORK SHEET'!E25)","v":"S.G.T."},{"$f":"'WORK SHEET'!E8","v":11393579473},{"$f":"'P. TOKEN'!M20","v":1194},null,1,{"$f":"C4","v":"SYNDICATE BANK DARSI"},null,null,{"$f":"CONCATENATE(\"Arrear bill of Sri/Smt \",'WORK SHEET'!E2,\" of \",'WORK SHEET'!E3,\" \",'WORK SHEET'!E4,\" for AAS increments\")","v":"Arrear bill of Sri/Smt SK.KHAJARAHAMTULLA of MPPS(G) POTLAPADU for AAS increments"},null,null,{"$f":"G9","v":1194}]
[null,null,"TOTAL",null,null,null,{"$f":"G9","v":1194}]
[{"$f":"[1]BILL!B94","v":"RUPEES ONE LAKH TWENTY EIGHT THOUSAND FOUR  HUNDRED AND EIGHTY EIGHT  ONLEY"}]
[{"$f":"'P. TOKEN'!B22","v":"RUPEES : ONE THOUSAND ONE HUNDRED AND NINETY FOUR  ONLY"}]
[null,null,null,null,null,null,null,null,null,null,null,null,"TOTAL",null,null,{"$f":"P9","v":1194}]
[null,null,null,null,null,null,null,null,{"$f":"A12","v":"RUPEES : ONE THOUSAND ONE HUNDRED AND NINETY FOUR  ONLY"}]
["DDO Signature:",null,null,null,null,"Signature of TO."]
["(with seal)",null,null,null,null,"(with seal)"]
[null,null,null,null,null,null,null,null,"DDO Signature",null,null,null,null,null,"Signature of S.T.O."]

{"sheet":"101","index":4,"n_rows":29,"n_cols":16,"rows_kept":29,"cut":false,"hidden":false,"merged":[[13,13,13,15],[0,0,0,15],[1,0,1,15],[2,0,2,15],[5,3,5,8],[30,0,30,3],[7,12,7,15],[11,3,11,9],[16,0,16,15],[19,10,19,15],[22,0,22,3],[27,0,27,3],[27,10,27,15],[7,3,7,8],[13,5,13,6],[28,10,28,15],[29,0,29,3],[14,0,14,15],[15,11,15,15],[15,1,15,7],[13,9,13,10]]}
["A.P.T.C. FORM-101"]
["(See Subsidiary Rule2(w) Under Treasury Rule 15"]
["Govt.Memo No.38907/Accounts/ 65-5,Dt.21-02-1963)"]
[]
[]
["DDO CODE:",null,null,{"$f":"'P. TOKEN'!B7","v":"07050308026"},null,null,null,null,null,null,"Treasury / PAO Code:",null,{"$f":"'P. TOKEN'!B5","v":0},{"$f":"'P. TOKEN'!C5","v":7},{"$f":"'P. TOKEN'!D5","v":0},{"$f":"'P. TOKEN'!E5","v":5}]
[]
["DDO Designation:",null,null,{"$f":"'P. TOKEN'!B9","v":"M.E.O."},null,null,null,null,null,null,"Treasury / PAO  NAME:",null,{"$f":"'P. TOKEN'!B6","v":"STO;DARSI"}]
[]
["To"]
["The Treasury Officer/Manager"]
["State Bank of India, ",null,null,{"$f":"'P. TOKEN'!I11","v":"SYNDICATE BANK DARSI"}]
[]
["Please Pay Bill No.          ",null,null,null,null,"/ 2011 - 12",null,"Dated:",null,null,null,"                  for  Rs.",null,{"$f":"'P. TOKEN'!M20","v":1194}]
[{"$f":"'47-FRONT'!B59","v":"RUPEES : ONE THOUSAND ONE HUNDRED AND NINETY FOUR  ONLY"}]
["to Sri   ",{"$f":"'P. TOKEN'!B23&\", \"&'P. TOKEN'!K23","v":"J.V.V.M.SUDHAKAR, M.R.P"},null,null,null,null,null,null,"for the office of the",null,null,{"$f":"'47-FRONT'!R12","v":"MRC, KURICHEDU"}]
["whose specimen signature is attested here with."]
[]
[]
["Signature of the Govt. Servant",null,null,null,null,null,null,null,null,null,"Received the payment"]
[]
["Dated:",null,null,null,null,null,null,null,null,null,"Dated :"]
["Attested"]
[]
[]
[]
[]
["Signature of the D.D.O.",null,null,null,null,null,null,null,null,null,"Signature of the Govt."]
[null,null,null,null,null,null,null,null,null,null,"Servant receiving the payment"]

{"sheet":"PROCEEDINGS","index":5,"n_rows":43,"n_cols":10,"rows_kept":43,"cut":false,"hidden":false,"merged":[[37,1,37,9],[24,1,27,1],[17,6,17,9],[18,6,18,9],[19,6,19,9],[20,6,20,9],[21,6,21,9],[22,6,22,9],[30,2,30,5],[31,7,31,9],[20,2,20,4],[17,2,17,4],[18,2,18,4],[36,1,36,9],[6,3,6,8],[31,5,31,6],[31,1,31,2],[33,5,33,6],[34,5,34,6],[32,5,32,6],[5,3,5,8],[16,1,16,8],[35,2,35,5],[35,6,35,9],[0,1,0,9],[1,1,1,9],[28,6,28,9],[29,6,29,9],[30,6,30,9],[15,1,15,9],[32,7,32,9],[33,7,33,9],[34,7,34,9],[32,1,32,2],[33,1,33,2],[34,1,34,2]]}
[null,{"$f":"CONCATENATE(\"PROCEEDINGS OF THE \",IF('WORK SHEET'!E123=1,\"DEPUTY EDUCATIONAL OFFICER, \",VLOOKUP('WORK SHEET'!E124,'WORK SHEET'!AS52:BB55,9,TRUE)),\" \",IF('WORK SHEET'!E123=1,CONCATENATE('WORK SHEET'!E24,\" DIVISION\"),VLOOKUP('WORK SHEET'!E124,'WORK SHEET'!AS52:BB55,10,TRUE)))","v":"PROCEEDINGS OF THE MANDAL EDUCATIONAL OFFICER KURICHEDU"}]
[null,{"$f":"CONCATENATE(\"PRESENT :- \",'WORK SHEET'!E16)","v":"PRESENT :- N.vijayakumar"}]
[]
[null,"Rc.No.",{"$f":"'WORK SHEET'!E14","v":"2/AAS/2011"},null,null,null,null,"DATED :",{"$f":"'WORK SHEET'!E15","v":"2011-08-01"}]
[]
[null,null,"SUB:- ",{"$f":"CONCATENATE(\"Estt-\",IF(H40=\"DEPUTY EDUCATIONAL OFFICER.\",\"APES -\",\"APSESS -\"),'47-FRONT'!H26,\" - \",H41,\" - \",H42)","v":"Estt-APSESS -Elementry Education - MANDAL PARASAD  - KURICHEDU"}]
[null,null,null,{"$f":"CONCATENATE(\"Sri/Smt \",'WORK SHEET'!E2,\" \",IF('WORK SHEET'!E41=\"YES\",'WORK SHEET'!G144,'WORK SHEET'!E25), \" - \",\" sanction of automaatic advancement increments \")","v":"Sri/Smt SK.KHAJARAHAMTULLA S.G.T. -  sanction of automaatic advancement increments "}]
[null,null,null,{"$f":"CONCATENATE('WORK SHEET'!N73,\" increment -ORDERS ISSUED\")","v":"S.P.P.-1A increment -ORDERS ISSUED"}]
[null,null,"REF:-","1.G.O.Ms No.52 Finance  Dept., dated: 25-02-2010"]
[null,null,null,"2.G.O.Ms.No.96 Fin(P.C.-II)Dept, Dt:20/05/2011"]
[null,null,null,"4.G.O.Ms No:40 Edn. Dept Dt: 07/02/02"]
[null,null,null,"5.Option exercised by the individual"]
[]
[null,null,null,null,null,"--oOo--"]
[null,"ORDER"]
[null,{"$f":"CONCATENATE(\"               In pursuance of the orders issued in reference 1 to 4 cited above the pay of sri/smt \",'WORK SHEET'!E2,\" of \",'WORK SHEET'!E3,\" \",'WORK SHEET'!E4,\" sanctined and fixed  \",'WORK SHEET'!N73, \" scale in \",'WORK SHEET'!E25,\" cadre with effect from the following date as shown below.\")","v":"               In pursuance of the orders issued in reference 1 to 4 cited above the pay of sri/smt SK.KHAJARAHAMTULLA of MPPS(G) POTLAPADU sanctined and fixed  S.P.P.-1A scale in S.G.T. cadre with effect from the following date as shown below."}]
[]
[null,1,"Name of the Teacher",null,null,null,{"$f":"'WORK SHEET'!E2","v":"SK.KHAJARAHAMTULLA"}]
[null,2,"Designation",null,null,null,{"$f":"IF('WORK SHEET'!E41='WORK SHEET'!O106,'WORK SHEET'!E44,'WORK SHEET'!E25)","v":"S.G.T."}]
[null,3,{"$f":"CONCATENATE(\"Date of firstappointment as \",'WORK SHEET'!E25)","v":"Date of firstappointment as S.G.T."},null,null,null,{"$f":"'WORK SHEET'!E92","v":"1997-08-06"}]
[null,4,"Date of regularigation in this cadre",null,null,null,{"$f":"'WORK SHEET'!E93","v":"1997-08-06"}]
[null,5,{"$f":"CONCATENATE(\"Date of compleation of \",'WORK SHEET'!F53,\" years in this cadre\")","v":"Date of compleation of 12 years in this cadre"},null,null,null,{"$f":"'WORK SHEET'!E94","v":"2009-08-06"}]
[null,6,{"$f":"CONCATENATE(\"Date of effect in \", 'WORK SHEET'!N73, \"  time scale\")","v":"Date of effect in S.P.P.-1A  time scale"},null,null,null,{"$f":"'WORK SHEET'!C244","v":"2010-02-01"}]
[null,7,"Perticulars of E.O.L. aviled",null,null,null,{"$f":"IF('WORK SHEET'!E64=0,\"NIL\",CONCATENATE('WORK SHEET'!E64,\" days\"))","v":"NIL"},{"$f":"IF('WORK SHEET'!E64=0,\" \",\"FROM\")","v":" "},{"$f":"IF('WORK SHEET'!E64=0,\" \",\"To\")","v":" "}]
[null,null,null,null,null,null,null,{"$f":"IF('WORK SHEET'!E46='WORK SHEET'!O107,\" \",IF('WORK SHEET'!F47=0,\" \",'WORK SHEET'!F47))","v":" "},{"$f":"IF('WORK SHEET'!E46='WORK SHEET'!O107,\" \",IF('WORK SHEET'!F47=0,\" \",'WORK SHEET'!G47))","v":" "},{"$f":"IF(H25=\" \",\" \",CONCATENATE('WORK SHEET'!P53,\" days\"))","v":" "}]
[null,null,null,null,null,null,null,{"$f":"IF('WORK SHEET'!E46='WORK SHEET'!O107,\" \",IF('WORK SHEET'!F48=0,\" \",'WORK SHEET'!F48))","v":" "},{"$f":"IF('WORK SHEET'!E46='WORK SHEET'!O107,\" \",IF('WORK SHEET'!F48=0,\" \",'WORK SHEET'!G48))","v":" "},{"$f":"IF(H26=\" \",\" \",CONCATENATE('WORK SHEET'!P54,\" days\"))","v":" "}]
[null,null,null,null,null,null,null,{"$f":"IF('WORK SHEET'!E46='WORK SHEET'!O107,\" \",IF('WORK SHEET'!F49=0,\" \",'WORK SHEET'!F49))","v":" "},{"$f":"IF('WORK SHEET'!E46='WORK SHEET'!O107,\" \",IF('WORK SHEET'!F49=0,\" \",'WORK SHEET'!G49))","v":" "},{"$f":"IF(H27=\" \",\" \",CONCATENATE('WORK SHEET'!P55,\" days\"))","v":" "}]
[null,null,null,null,null,null,null,{"$f":"IF('WORK SHEET'!E46='WORK SHEET'!O107,\" \",IF('WORK SHEET'!F50=0,\" \",'WORK SHEET'!F50))","v":" "},{"$f":"IF('WORK SHEET'!E46='WORK SHEET'!O107,\" \",IF('WORK SHEET'!F50=0,\" \",'WORK SHEET'!G50))","v":" "},{"$f":"IF(H28=\" \",\" \",CONCATENATE('WORK SHEET'!P56,\" days\"))","v":" "}]
[null,8,"wether departmental tests passed ",null,null,null,{"$f":"'WORK SHEET'!E31","v":"NO"}]
[null,9,"Pay and Scale of pay as on",null,null,{"$f":"BILL!D5","v":"2010-02-01"},{"$f":"CONCATENATE(\"Rs. \",'WORK SHEET'!E96,\" / -                     \",'WORK SHEET'!G96)","v":"Rs. 14440 / -                     11530-33200"}]
[null,10,{"$f":"CONCATENATE(\"Pay and Scale after  fixition in \",'WORK SHEET'!N73,'WORK SHEET'!N74)","v":"Pay and Scale after  fixition in S.P.P.-1A as per FR 22(a)(i)"},null,null,null,{"$f":"CONCATENATE(\"Rs. \",'WORK SHEET'!E97,\" /-                                                 \",'WORK SHEET'!F97)","v":"Rs. 14860 /-                                                 14860-420-15700-450-17050-490-18520-530-20110-570-21820-610-23650-650-25600-700-27700-750-29950-800-32350-850-34900-900-37600-970-39540"}]
[null,"Date of subsequent increments",null,"Basic pay","Basic after incremt","scale of pay",null,"Remarks"]
[null,{"$f":"'WORK SHEET'!F109","v":"2010-08-01"},null,{"$f":"IF(B33=\" \",\" \",'WORK SHEET'!I109)","v":14860},{"$f":"IF(B33=\" \",\" \",'WORK SHEET'!H109)","v":15280},{"$f":"IF(B33=\" \",\" \",'WORK SHEET'!L109)","v":"14860-39540"},null,{"$f":"IF('WORK SHEET'!E41='WORK SHEET'!O107,\" \",CONCATENATE(\"PROMOTED AS \",'WORK SHEET'!E44,\" WITH \"))","v":" "}]
[null,{"$f":"IF('WORK SHEET'!F110=0,\" \",'WORK SHEET'!F110)","v":" "},null,{"$f":"IF(B34=\" \",\" \",'WORK SHEET'!I110)","v":" "},{"$f":"IF(B34=\" \",\" \",'WORK SHEET'!H110)","v":" "},{"$f":"IF(B34=\" \",\" \",'WORK SHEET'!L110)","v":" "},null,{"$f":"IF(H33=\" \",\" \",'WORK SHEET'!R108)","v":" "}]
[null,{"$f":"IF('WORK SHEET'!F111=0,\" \",'WORK SHEET'!F111)","v":" "},null,{"$f":"IF(B35=\" \",\" \",'WORK SHEET'!I111)","v":" "},{"$f":"IF(B35=\" \",\" \",'WORK SHEET'!H111)","v":" "},{"$f":"IF(B35=\" \",\" \",'WORK SHEET'!L111)","v":" "},null,{"$f":"IF(H34=\" \",\" \",'WORK SHEET'!E138)","v":" "}]
[null,11,"Date of next increment",null,null,null,{"$f":"'WORK SHEET'!F98","v":"2011-08-01"}]
[null,"           The arrears of pay fixations under AAS in RPS-2010 from 01-02-2010 to 31-05-2011 will be credited in G.P.F./Z.P.P.F. Accout.From 01-06-2011 will be paid in cash"]
[null,"      In the pay is found erroneous at any time the excess amount paid to the individual will be recovered in lumpsum without any prior notice."]
[]
[null,"Copy to ",null,null,null,null,null,{"$f":"IF('WORK SHEET'!E123=1,\"DEPUTY EDUCATIONAL OFFICER.\",VLOOKUP('WORK SHEET'!E124,'WORK SHEET'!AS52:BA55,9,TRUE))","v":"MANDAL EDUCATIONAL OFFICER"}]
[null,"Sri /Smt./Kum",{"$f":"CONCATENATE('WORK SHEET'!E2,\", \",IF('WORK SHEET'!E127=1,'WORK SHEET'!E44,'WORK SHEET'!E25),\", \", 'WORK SHEET'!E3,\", \", 'WORK SHEET'!E4)","v":"SK.KHAJARAHAMTULLA, S.G.T., MPPS(G), POTLAPADU"},null,null,null,null,{"$f":"IF('WORK SHEET'!E123=1,CONCATENATE(H42,\" DIVISION\"),IF(OR('WORK SHEET'!E124=2,'WORK SHEET'!E124=4),'WORK SHEET'!E3,\"MANDAL PARASAD \"))","v":"MANDAL PARASAD "}]
[null,"Copy to Bill, Service Register",null,null,null,null,null,{"$f":"IF('WORK SHEET'!E123=1,'WORK SHEET'!E24,IF(OR('WORK SHEET'!E124=1,'WORK SHEET'!E124=3),'WORK SHEET'!E5,'WORK SHEET'!E4))","v":"KURICHEDU"}]
[null,{"$f":"CONCATENATE(\"Copy to the \",'WORK SHEET'!E18)","v":"Copy to the STO;DARSI"}]

{"sheet":"47-FRONT","index":6,"n_rows":70,"n_cols":24,"rows_kept":70,"cut":false,"hidden":false,"merged":[[60,1,60,23],[63,1,63,23],[64,0,68,0],[54,7,54,11],[55,7,55,11],[56,7,56,11],[58,1,59,11],[21,0,63,0],[52,7,52,11],[52,19,52,23],[49,7,49,11],[49,19,49,23],[53,7,53,11],[53,19,53,23],[50,7,50,11],[50,19,50,23],[51,7,51,11],[51,19,51,23],[46,7,46,11],[46,19,46,23],[47,7,47,11],[47,19,47,23],[48,7,48,11],[48,19,48,23],[43,7,43,11],[43,19,43,23],[44,7,44,11],[44,19,44,23],[45,7,45,11],[45,19,45,23],[39,19,39,23],[40,19,40,23],[41,7,41,11],[41,19,41,23],[42,7,42,11],[42,19,42,23],[38,19,38,23],[23,19,23,23],[25,19,25,23],[27,7,27,11],[27,19,27,23],[29,19,29,23],[31,7,31,11],[31,19,31,23],[33,19,33,23],[34,19,34,23],[35,19,35,23],[36,19,36,23],[37,19,37,23],[14,13,14,16],[16,9,16,11],[14,17,14,23],[9,1,9,4],[11,12,11,16],[11,17,11,23],[9,20,9,23],[11,5,11,11],[6,1,6,4],[6,17,6,18],[6,20,6,23],[0,1,0,21],[2,1,2,23],[1,1,1,23],[3,17,3,23],[4,1,4,4]]}
[null,{"$f":"CONCATENATE(\"AAS ARREAR BILLOF\",\"  \",'WORK SHEET'!E3,\", \",'WORK SHEET'!E4,\", \",'WORK SHEET'!E5)","v":"AAS ARREAR BILLOF  MPPS(G), POTLAPADU, KURICHEDU"},null,null,null,null,null,null,null,null,null,null,null,null,null,null,null,null,null,null,null,null,null,{"$f":"'WORK SHEET'!E62","v":"2009-08-06"}]
[null,{"$f":"CONCATENATE(\"Payable At Sub-Treasury Office - \",'WORK SHEET'!E18)","v":"Payable At Sub-Treasury Office - STO;DARSI"}]
[null,"  GOVERNMENT OF ANDHRA PRADESH                                                                                                                                                         ( A.P.T.C.Form - 47 )                     \n"]
[null,null,null,null,null,null,null,null,null,null,null,null,null,null,null,null,null,"(For Treasury Use Only)"]
[null,"Pay Bill for the Month & Year",null,null,null,{"$f":"IF(MONTH(X1)<=9,0,1)","v":0},{"$f":"IF(MONTH(X1)>9,MONTH(X1)-10,MONTH(X1))","v":8},null,2,0,1,0,null,null,null,null,null,"DATE:  _____________"]
[]
[null,"Treasury / P.A.O Code ",null,null,null,{"$f":"F10","v":0},{"$f":"G10","v":7},{"$f":"H10","v":0},{"$f":"I10","v":5},null,null,null,null,null,null,null,null,"Trans ID: "]
[]
[]
[null,"D.D.O.Code ",null,null,null,{"$f":"'WORK SHEET'!E122","v":0},{"$f":"'WORK SHEET'!F122","v":7},{"$f":"'WORK SHEET'!G122","v":0},{"$f":"'WORK SHEET'!H122","v":5},{"$f":"'WORK SHEET'!I122","v":0},{"$f":"'WORK SHEET'!J122","v":3},{"$f":"'WORK SHEET'!K122","v":0},{"$f":"'WORK SHEET'!L122","v":8},{"$f":"'WORK SHEET'!M122","v":0},{"$f":"'WORK SHEET'!N122","v":2},{"$f":"'WORK SHEET'!O122","v":6},null,"District  :PRAKASAM",null,null,{"$f":"'WORK SHEET'!E6","v":"PRAKASAM"}]
[]
[null,"DDO Designation",null,null,null,{"$f":"VLOOKUP('WORK SHEET'!E124,'WORK SHEET'!AS52:BB55,9,TRUE)","v":"MANDAL EDUCATIONAL OFFICER"},null,null,null,null,null,null,"DDO OFFICE NAME :",null,null,null,null,{"$f":"VLOOKUP('WORK SHEET'!E124,'WORK SHEET'!AS52:BD55,12,TRUE)","v":"MRC, KURICHEDU"}]
[]
[]
[null,"BANK CODE",null,null,null,{"$f":"'WORK SHEET'!E130","v":3},{"$f":"'WORK SHEET'!F130","v":6},{"$f":"'WORK SHEET'!G130","v":4},{"$f":"'WORK SHEET'!H130","v":1},null,null,null,null,"BANK NAME:",null,null,null,{"$f":"'WORK SHEET'!E20","v":"SYNDICATE BANK DARSI"}]
[]
[null,"DDOs TBR No.",null,null,null,0,null,null,null," / 2010-11"]
[]
[]
[]
[]
[{"$f":"'WORK SHEET'!AJ135","v":" UNDER RUPEES : ONE THOUSAND ONE HUNDRED AND NINETY TWO ONLY"},null,null,null,null,null,null,null,null,null,null,null,null,null,null,null,null,"Permanent / Temporary"]
[null,"Head of Account",null,null,null,null,null,null,null,null,null,null,"Deducations",null,null,null,null,null,null,"Amount"]
[null,"Major Head ",null,null,2,2,0,2,"General Education",null,null,null,1,"G.P.F/AIS/PF",null,null,null,null,"Rs.",{"$f":"IF('WORK SHEET'!E9='WORK SHEET'!N106,\" \",BILL!AH27)","v":" "}]
[]
[null,"Sub Major",null,null,0,{"$f":"VLOOKUP('WORK SHEET'!E124,'WORK SHEET'!AS52:AZ55,7,TRUE)","v":1},null,{"$f":"VLOOKUP('WORK SHEET'!E124,'WORK SHEET'!AS52:AZ55,8,TRUE)","v":"Elementry Education"},null,null,null,null,2,"APGLI",null,null,null,null,"Rs."]
[]
[null,"Minor Head ",null,null,1,{"$f":"VLOOKUP('WORK SHEET'!E124,'WORK SHEET'!AS52:AZ55,3,TRUE)","v":0},{"$f":"VLOOKUP('WORK SHEET'!E124,'WORK SHEET'!AS52:AZ55,4,TRUE)","v":3},{"$f":"VLOOKUP('WORK SHEET'!E124,'WORK SHEET'!AS52:AZ55,2,TRUE)","v":"Assistance to Local Bodies for Primary Education"},null,null,null,null,3,"Group Insurance/AIS",null,null,null,null,"Rs."]
[]
[null,"Group Sub-Head",null,null,null,null,null,null,null,null,null,null,4,"Professional Tax",null,null,null,null,"Rs."]
[]
[null,"Sub Head",null,null,0,{"$f":"VLOOKUP('WORK SHEET'!E124,'WORK SHEET'!AS52:AZ55,6,TRUE)","v":5},null,{"$f":"VLOOKUP('WORK SHEET'!E124,'WORK SHEET'!AS52:AZ55,5,TRUE)","v":"Teaching Grant to Mandal Praja Parishad"},null,null,null,null,5,"House Rent",null,null,null,null,"Rs."]
[]
[null,"Detail Head",null,null,0,1,0,"Salaries",null,null,null,null,6,"Festival Adv.&APCO Adv.",null,null,null,null,"Rs."]
[null,null,null,null,null,null,null,null,null,null,null,null,7,"Educational Adv.",null,null,null,null,"Rs."]
[null,null,null,null,null,null,null,null,null,null,null,null,8,"HBA (P)",null,null,null,null,"Rs."]
[null,"Non-plan=N/Plan=P",null,null,null,"N","Charged=C/Voted=V",null,null,null,"V",null,9,"HBA (I)",null,null,null,null,"Rs."]
[null,"Contingency Fund/MH",null,null,null,null,null,null,null,null,null,null,10,"Car Adv.(P)",null,null,null,null,"Rs."]
[null,"Service Major Head",null,null,null,2,2,0,2,null,null,null,11,"Car Adv.(I)",null,null,null,null,"Rs."]
[null,null,null,null,null,null,null,null,null,null,null,null,12,"Motor Cycle Adv.(P)",null,null,null,null,"Rs."]
[null,null,null,null,null,null,null,null,null,null,null,null,13,"Motor Cycle Adv.(I)",null,null,null,null,"Rs."]
[null,"011 - Pay",null,null,null,null,"Rs.",{"$f":"BILL!AA38+BILL!AA27","v":8039},null,null,null,null,14,"Cycle Adv.",null,null,null,null,"Rs."]
[null,"012-   Allowances",null,null,null,null,"Rs.",null,null,null,null,null,15,"Marriage Adv.(P)",null,null,null,null,"Rs."]
[null,"013 - Dearness Allowances",null,null,null,null,"Rs.",{"$f":"BILL!AB38+BILL!AB27","v":1989},null,null,null,null,16,"Marriage Adv.(I)",null,null,null,null,"Rs."]
[null,"015-   I.R.",null,null,null,null,"Rs.",null,null,null,null,null,17,"Income Tax",null,null,null,null,"Rs."]
[null,"016-   H.R.A.",null,null,null,null,"Rs.",{"$f":"BILL!AC38+BILL!AC27","v":849},null,null,null,null,18,"Class IV GPF- D.T.O",null,null,null,null,"Rs."]
[null,null,null,null,null,null,"Rs.",null,null,null,null,null,19,"EWF Loan",null,null,null,null,"Rs."]
[null,null,null,null,null,null,"Rs.",null,null,null,null,null,20,"ZPPF",null,null,null,null,"Rs.",{"$f":"IF('WORK SHEET'!E9='WORK SHEET'!N107,\" \",BILL!AH27)","v":9004}]
[null,null,null,{"$error":"#REF!"},null,null,"Rs.",null,null,null,null,null,21,null,null,null,null,null,"Rs.",{"$f":"IF([2]BILL!AF92=0,\" \",[2]BILL!AF92)","v":" "}]
[null,null,null,null,null,null,"Rs.",null,null,null,null,null,22,null,null,null,null,null,"Rs."]
[null,null,null,null,null,null,"Rs.",null,null,null,null,null,23,null,null,null,null,null,"Rs."]
[null,null,null,null,null,null,"Rs.",null,null,null,null,null,24,null,null,null,null,null,"Rs."]
[null,null,null,null,null,null,"Rs.",null,null,null,null,null,25,null,null,null,null,null,"Rs."]
[null,null,null,null,null,null,"Rs.",null,null,null,null,null,"Total Govt. Deducations",null,null,null,null,null,"Rs.",{"$f":"SUM(T24:T53)","v":9004}]
[null,"Gross Total ",null,null,null,null,"Rs.",{"$f":"BILL!AH38+BILL!AH27","v":10198},null,null,null,null,"Total Non-Govt.Deducations",null,null,null,null,null,"Rs."]
[null,"Less Govt. Deductions",null,null,null,null,"Rs.",{"$f":"T54","v":9004}]
[null,"A.G.Nett Amount",null,null,null,null,"Rs.",{"$f":"H55-H56","v":1194}]
[null,"A.G.Nett Amount in words "]
[null,{"$f":"'BILL-P.F & CASH'!A41","v":"RUPEES : ONE THOUSAND ONE HUNDRED AND NINETY FOUR  ONLY"}]
[null,null,null,null,null,null,null,null,null,null,null,null,null,null,null,null,null,null,"Drawing Officer"]
[null,"FOR USE IN TREASURY / PAY & ACCOUNTS OFFICE ONLY"]
[null,"Pay","_________________ ",null,null,null,null,"(Rupees ____________________________________________________"]
[null,"_______________________________________________________ Only) by Cash / Cheque / Draft / "]
[null,"Account credit as under and Rs________________________________________________________"]
[{"$f":"H57+1","v":1195},"____________________________________________ only) by adjustment."]
[]
[null,null,null,null,"1.Rs._________________ by transfer credit to the SB Accounts of the Employees (as per Annexure-I)"]
[null,null,null,null,"2.Rs._________________ by transfer credit to the DDO Account towards of Non-Govt.Deducations."]
[]
["Rs",null,null,null,null,null,null,null,null,null,null,null,null,"Treasury Officer / Pay & Accounts Officer"]

{"sheet":"BILL-NOTIONAL","index":7,"n_rows":63,"n_cols":22,"rows_kept":63,"cut":false,"hidden":true,"merged":[[5,2,5,9],[0,20,0,21],[0,0,0,19],[41,5,41,6],[10,5,10,6],[26,5,26,6],[32,2,32,9],[41,7,41,8],[37,7,37,8],[30,7,30,8],[26,7,26,8],[30,5,30,6],[37,5,37,6],[10,1,10,2],[14,1,14,2],[18,7,18,8],[22,5,22,6],[18,1,18,2],[45,1,45,2],[22,1,22,2],[49,1,49,2],[57,1,57,2],[26,1,26,2],[30,1,30,2],[37,1,37,2],[53,1,53,2],[41,1,41,2],[61,7,61,8],[57,7,57,8],[53,7,53,8],[57,5,57,6],[61,5,61,6],[62,1,62,2],[62,5,62,6],[62,7,62,8],[2,2,2,9],[3,2,3,9],[45,5,45,6],[14,5,14,6],[18,5,18,6],[49,5,49,6],[53,5,53,6],[45,7,45,8],[49,7,49,8],[61,1,61,2],[10,7,10,8],[14,7,14,8],[22,7,22,8]]}
[{"$f":"CONCATENATE(\"PRC-08 ARREAR OF\",\" \",'WORK SHEET'!E2,\" ,\",'WORK SHEET'!E54,\", \",'WORK SHEET'!E3,\", \",'WORK SHEET'!E4,\", \",'WORK SHEET'!E5,\", MANDAL\",\" FROM 01-07-2008 To\")","v":"PRC-08 ARREAR OF SK.KHAJARAHAMTULLA ,, MPPS(G), POTLAPADU, KURICHEDU, MANDAL FROM 01-07-2008 To"},null,null,null,null,null,null,null,null,null,null,null,null,null,null,null,null,null,null,null,{"$f":"'BILL-P.F & CASH'!P17","v":"2011-07-30T00:14:24"}]
[]
[null,"Sl.No","Name and Designation",null,null,null,null,null,null,null,"Pay","D.A","H.R.A","I.R",{"$f":"G7","v":0},{"$f":"H7","v":0},{"$f":"I7","v":0},"Grand Total","GPF","Z.P.P.F","Govt Deductions","Net "]
[null,1,2,null,null,null,null,null,null,null,3,4,5,6,7,8,9,10,11,12,13,14]
[{"$f":"'WORK SHEET'!E7","v":724731},1,{"$f":"'WORK SHEET'!E2","v":"SK.KHAJARAHAMTULLA"},null,null,null,null,null,{"$f":"'WORK SHEET'!E54","v":0},null,"PART - I ( NOTIONAL FROM 01-07-2008 to 31-01-2010 = 19 MONTHS )"]
[null,null,{"$f":"PROCEEDINGS!#REF!","v":{"$error":"#REF!"}}]
[null,null,"PAY","D.A.","H.R.A.","I.R",null,null,null,"TOTAL"]
[{"$f":"CONCATENATE('WORK SHEET'!L201,\"%\")","v":"%"},"T.D.",{"$f":"'WORK SHEET'!E201","v":0},{"$f":"ROUND(C8*A8,0)","v":{"$error":"#VALUE!"}},{"$f":"ROUND(C8*'WORK SHEET'!N181/100,0)","v":0},0,null,null,null,{"$f":"SUM(C8:I8)","v":{"$error":"#VALUE!"}}]
[{"$f":"CONCATENATE('WORK SHEET'!K201,\"%\")","v":"%"},"A.D.",{"$f":"'WORK SHEET'!M201","v":0},{"$f":"ROUND(C9*A9,0)","v":{"$error":"#VALUE!"}},{"$f":"ROUND(C9*'WORK SHEET'!N181/100,0)","v":0},{"$f":"ROUND(C9*IF(D11<39722,0,IF(D11<39814,15,22))/100,0)","v":0},null,null,null,{"$f":"SUM(C9:I9)","v":{"$error":"#VALUE!"}}]
[{"$f":"CONCATENATE(\"HRA \",'WORK SHEET'!J201,\"%\")","v":"HRA %"},"DIF.",{"$f":"C8-C9","v":0},{"$f":"D8-D9","v":{"$error":"#VALUE!"}},{"$f":"E8-E9","v":0},{"$f":"F8-F9","v":0},null,null,null,{"$f":"J8-J9","v":{"$error":"#VALUE!"}}]
[{"$f":"'WORK SHEET'!D201","v":0},"Period from",null,{"$f":"'WORK SHEET'!C201","v":"00:00:00"},"to",{"$f":"'WORK SHEET'!F201","v":"00:00:00"},null,"Months",null,{"$f":"'WORK SHEET'!I201","v":0},{"$f":"ROUND(C10*J11,0)","v":0},{"$f":"ROUND(D10*J11,0)","v":{"$error":"#VALUE!"}},{"$f":"ROUND(E10*J11,0)","v":0},{"$f":"ROUND(F10*J11,0)","v":0},{"$f":"IF('WORK SHEET'!D94=0,\" \",ROUND(G10*J11,0))","v":" "},{"$f":"IF('WORK SHEET'!D95=0,\" \",ROUND(H10*J11,0))","v":" "},{"$f":"IF('WORK SHEET'!D96=0,\" \",ROUND(I10*J11,0))","v":" "},{"$f":"SUM(K11:Q11)","v":{"$error":"#VALUE!"}}]
[{"$f":"CONCATENATE('WORK SHEET'!L202,\"%\")","v":"%"},"T.D.",{"$f":"'WORK SHEET'!E202","v":0},{"$f":"ROUND(C12*A12,0)","v":{"$error":"#VALUE!"}},{"$f":"ROUND(C12*'WORK SHEET'!N182/100,0)","v":0},0,null,null,null,{"$f":"SUM(C12:I12)","v":{"$error":"#VALUE!"}}]
[{"$f":"CONCATENATE('WORK SHEET'!K202,\"%\")","v":"%"},"A.D.",{"$f":"'WORK SHEET'!M202","v":0},{"$f":"ROUND(C13*A13,0)","v":{"$error":"#VALUE!"}},{"$f":"ROUND(C13*'WORK SHEET'!N182/100,0)","v":0},{"$f":"ROUND(C13*IF(D15<39722,0,IF(D15<39814,15,22))/100,0)","v":0},null,null,null,{"$f":"SUM(C13:I13)","v":{"$error":"#VALUE!"}}]
[{"$f":"CONCATENATE(\"HRA \",'WORK SHEET'!J202,\"%\")","v":"HRA %"},"DIF.",{"$f":"C12-C13","v":0},{"$f":"D12-D13","v":{"$error":"#VALUE!"}},{"$f":"E12-E13","v":0},{"$f":"F12-F13","v":0},null,null,null,{"$f":"J12-J13","v":{"$error":"#VALUE!"}}]
[{"$f":"'WORK SHEET'!D202","v":0},"Period from",null,{"$f":"'WORK SHEET'!C202","v":"00:00:00"},"to",{"$f":"'WORK SHEET'!F202","v":"00:00:00"},null,"Months",null,{"$f":"'WORK SHEET'!I202","v":0},{"$f":"ROUND(C14*J15,0)","v":0},{"$f":"ROUND(D14*J15,0)","v":{"$error":"#VALUE!"}},{"$f":"ROUND(E14*J15,0)","v":0},{"$f":"ROUND(F14*J15,0)","v":0},{"$f":"IF('WORK SHEET'!D94=0,\" \",ROUND(G10*J15,0))","v":" "},{"$f":"IF('WORK SHEET'!D95=0,\" \",ROUND(H10*J15,0))","v":" "},{"$f":"IF('WORK SHEET'!D96=0,\" \",ROUND(I10*J15,0))","v":" "},{"$f":"SUM(K15:Q15)","v":{"$error":"#VALUE!"}}]
[{"$f":"CONCATENATE('WORK SHEET'!L203,\"%\")","v":"%"},"T.D.",{"$f":"'WORK SHEET'!E203","v":0},{"$f":"ROUND(C16*A16,0)","v":{"$error":"#VALUE!"}},{"$f":"ROUND(C16*'WORK SHEET'!N183/100,0)","v":0},0,null,null,null,{"$f":"SUM(C16:I16)","v":{"$error":"#VALUE!"}}]
[{"$f":"CONCATENATE('WORK SHEET'!K203,\"%\")","v":"%"},"A.D.",{"$f":"'WORK SHEET'!M203","v":0},{"$f":"ROUND(C17*A17,0)","v":{"$error":"#VALUE!"}},{"$f":"ROUND(C17*'WORK SHEET'!N183/100,0)","v":0},{"$f":"ROUND(C17*IF(D19<39722,0,IF(D19<39814,15,22))/100,0)","v":0},null,null,null,{"$f":"SUM(C17:I17)","v":{"$error":"#VALUE!"}}]
[{"$f":"CONCATENATE(\"HRA \",'WORK SHEET'!J203,\"%\")","v":"HRA %"},"DIF.",{"$f":"C16-C17","v":0},{"$f":"D16-D17","v":{"$error":"#VALUE!"}},{"$f":"E16-E17","v":0},{"$f":"F16-F17","v":0},null,null,null,{"$f":"J16-J17","v":{"$error":"#VALUE!"}}]
[{"$f":"'WORK SHEET'!D203","v":0},"Period from",null,{"$f":"'WORK SHEET'!C203","v":"00:00:00"},"to",{"$f":"'WORK SHEET'!F203","v":"00:00:00"},null,"Months",null,{"$f":"'WORK SHEET'!I203","v":0},{"$f":"ROUND(C18*J19,0)","v":0},{"$f":"ROUND(D18*J19,0)","v":{"$error":"#VALUE!"}},{"$f":"ROUND(E18*J19,0)","v":0},{"$f":"ROUND(F18*J19,0)","v":0},{"$f":"IF('WORK SHEET'!D94=0,\" \",ROUND(G10*J19,0))","v":" "},{"$f":"IF('WORK SHEET'!D95=0,\" \",ROUND(H10*J19,0))","v":" "},{"$f":"IF('WORK SHEET'!D96=0,\" \",ROUND(I10*J19,0))","v":" "},{"$f":"SUM(K19:Q19)","v":{"$error":"#VALUE!"}}]
[{"$f":"CONCATENATE('WORK SHEET'!L204,\"%\")","v":"%"},"T.D.",{"$f":"'WORK SHEET'!E204","v":0},{"$f":"ROUND(C20*A20,0)","v":{"$error":"#VALUE!"}},{"$f":"ROUND(C20*'WORK SHEET'!N184/100,0)","v":0},0,null,null,null,{"$f":"SUM(C20:I20)","v":{"$error":"#VALUE!"}}]
[{"$f":"CONCATENATE('WORK SHEET'!K204,\"%\")","v":"%"},"A.D.",{"$f":"'WORK SHEET'!M204","v":0},{"$f":"ROUND(C21*A21,0)","v":{"$error":"#VALUE!"}},{"$f":"ROUND(C21*'WORK SHEET'!N184/100,0)","v":0},{"$f":"ROUND(C21*IF(D23<39722,0,IF(D23<39814,15,22))/100,0)","v":0},null,null,null,{"$f":"SUM(C21:I21)","v":{"$error":"#VALUE!"}}]
[{"$f":"CONCATENATE(\"HRA \",'WORK SHEET'!J204,\"%\")","v":"HRA %"},"DIF.",{"$f":"C20-C21","v":0},{"$f":"D20-D21","v":{"$error":"#VALUE!"}},{"$f":"E20-E21","v":0},{"$f":"F20-F21","v":0},null,null,null,{"$f":"J20-J21","v":{"$error":"#VALUE!"}}]
[{"$f":"'WORK SHEET'!D204","v":0},"Period from",null,{"$f":"'WORK SHEET'!C204","v":"00:00:00"},"to",{"$f":"'WORK SHEET'!F204","v":"00:00:00"},null,"Months",null,{"$f":"'WORK SHEET'!I204","v":0},{"$f":"ROUND(C22*J23,0)","v":0},{"$f":"ROUND(D22*J23,0)","v":{"$error":"#VALUE!"}},{"$f":"ROUND(E22*J23,0)","v":0},{"$f":"ROUND(F22*J23,0)","v":0},{"$f":"IF('WORK SHEET'!D94=0,\" \",ROUND(G10*J23,0))","v":" "},{"$f":"IF('WORK SHEET'!D95=0,\" \",ROUND(H10*J23,0))","v":" "},{"$f":"IF('WORK SHEET'!D96=0,\" \",ROUND(I10*J23,0))","v":" "},{"$f":"SUM(K23:Q23)","v":{"$error":"#VALUE!"}}]
[{"$f":"CONCATENATE('WORK SHEET'!L205,\"%\")","v":"%"},"T.D.",{"$f":"'WORK SHEET'!E205","v":0},{"$f":"ROUND(C24*A24,0)","v":{"$error":"#VALUE!"}},{"$f":"ROUND(C24*'WORK SHEET'!N185/100,0)","v":0},0,null,null,null,{"$f":"SUM(C24:I24)","v":{"$error":"#VALUE!"}}]
[{"$f":"CONCATENATE('WORK SHEET'!K205,\"%\")","v":"%"},"A.D.",{"$f":"'WORK SHEET'!M205","v":0},{"$f":"ROUND(C25*A25,0)","v":{"$error":"#VALUE!"}},{"$f":"ROUND(C25*'WORK SHEET'!N185/100,0)","v":0},{"$f":"ROUND(C25*IF(D27<39722,0,IF(D27<39814,15,22))/100,0)","v":0},null,null,null,{"$f":"SUM(C25:I25)","v":{"$error":"#VALUE!"}}]
[{"$f":"CONCATENATE(\"HRA \",'WORK SHEET'!J205,\"%\")","v":"HRA %"},"DIF.",{"$f":"C24-C25","v":0},{"$f":"D24-D25","v":{"$error":"#VALUE!"}},{"$f":"E24-E25","v":0},{"$f":"F24-F25","v":0},null,null,null,{"$f":"J24-J25","v":{"$error":"#VALUE!"}}]
[{"$f":"'WORK SHEET'!D205","v":0},"Period from",null,{"$f":"'WORK SHEET'!C205","v":"00:00:00"},"to",{"$f":"'WORK SHEET'!F205","v":"00:00:00"},null,"Months",null,{"$f":"'WORK SHEET'!I205","v":0},{"$f":"ROUND(C26*J27,0)","v":0},{"$f":"ROUND(D26*J27,0)","v":{"$error":"#VALUE!"}},{"$f":"ROUND(E26*J27,0)","v":0},{"$f":"ROUND(F26*J27,0)","v":0},{"$f":"IF('WORK SHEET'!D94=0,\" \",ROUND(G10*J27,0))","v":" "},{"$f":"IF('WORK SHEET'!D95=0,\" \",ROUND(H10*J27,0))","v":" "},{"$f":"IF('WORK SHEET'!D96=0,\" \",ROUND(I10*J27,0))","v":" "},{"$f":"SUM(K27:Q27)","v":{"$error":"#VALUE!"}}]
[{"$f":"CONCATENATE('WORK SHEET'!L206,\"%\")","v":"%"},"T.D.",{"$f":"'WORK SHEET'!E206","v":0},{"$f":"ROUND(C28*A28,0)","v":{"$error":"#VALUE!"}},{"$f":"ROUND(C28*'WORK SHEET'!N186/100,0)","v":0},0,null,null,null,{"$f":"SUM(C28:I28)","v":{"$error":"#VALUE!"}}]
[{"$f":"CONCATENATE('WORK SHEET'!K206,\"%\")","v":"%"},"A.D.",{"$f":"'WORK SHEET'!M206","v":0},{"$f":"ROUND(C29*A29,0)","v":{"$error":"#VALUE!"}},{"$f":"ROUND(C29*'WORK SHEET'!N186/100,0)","v":0},{"$f":"ROUND(C29*IF(D31<39722,0,IF(D31<39814,15,22))/100,0)","v":0},null,null,null,{"$f":"SUM(C29:I29)","v":{"$error":"#VALUE!"}}]
[{"$f":"CONCATENATE(\"HRA \",'WORK SHEET'!J206,\"%\")","v":"HRA %"},"DIF.",{"$f":"C28-C29","v":0},{"$f":"D28-D29","v":{"$error":"#VALUE!"}},{"$f":"E28-E29","v":0},{"$f":"F28-F29","v":0},null,null,null,{"$f":"J28-J29","v":{"$error":"#VALUE!"}}]
[{"$f":"'WORK SHEET'!D206","v":0},"Period from",null,{"$f":"'WORK SHEET'!C206","v":"00:00:00"},"to",{"$f":"'WORK SHEET'!F206","v":"00:00:00"},null,"Months",null,{"$f":"'WORK SHEET'!I206","v":0},{"$f":"ROUND(C30*J31,0)","v":0},{"$f":"ROUND(D30*J31,0)","v":{"$error":"#VALUE!"}},{"$f":"ROUND(E30*J31,0)","v":0},{"$f":"ROUND(F30*J31,0)","v":0},{"$f":"IF('WORK SHEET'!D94=0,\" \",ROUND(G10*J31,0))","v":" "},{"$f":"IF('WORK SHEET'!D95=0,\" \",ROUND(H10*J31,0))","v":" "},{"$f":"IF('WORK SHEET'!D96=0,\" \",ROUND(I10*J31,0))","v":" "},{"$f":"SUM(K31:Q31)","v":{"$error":"#VALUE!"}}]
[null,null,null,null,null,"TOTAL",null,null,null,null,{"$f":"SUM(K11:K31)","v":0},{"$f":"SUM(L11:L31)","v":{"$error":"#VALUE!"}},0,0,0,0,0,{"$error":"#VALUE!"}]
[null,1,2,null,null,null,null,null,null,null,3,4,5,6,7,8,9,10,11,12,13,14]
[null,null,null,null,null,"B.F.",null,null,null,null,{"$f":"K32","v":0},{"$error":"#VALUE!"},0,0,0,0,0,{"$error":"#VALUE!"}]
[{"$f":"CONCATENATE('WORK SHEET'!L207,\"%\")","v":"%"},"T.D.",{"$f":"'WORK SHEET'!E207","v":0},{"$f":"ROUND(C35*A35,0)","v":{"$error":"#VALUE!"}},{"$f":"ROUND(C35*'WORK SHEET'!N187/100,0)","v":0},0,null,null,null,{"$f":"SUM(C35:I35)","v":{"$error":"#VALUE!"}}]
[{"$f":"CONCATENATE('WORK SHEET'!K207,\"%\")","v":"%"},"A.D.",{"$f":"'WORK SHEET'!M207","v":0},{"$f":"ROUND(C36*A36,0)","v":{"$error":"#VALUE!"}},{"$f":"ROUND(C36*'WORK SHEET'!N187/100,0)","v":0},{"$f":"ROUND(C36*IF(D38<39722,0,IF(D38<39814,15,22))/100,0)","v":0},null,null,null,{"$f":"SUM(C36:I36)","v":{"$error":"#VALUE!"}}]
[{"$f":"CONCATENATE(\"HRA \",'WORK SHEET'!J207,\"%\")","v":"HRA %"},"DIF.",{"$f":"C35-C36","v":0},{"$f":"D35-D36","v":{"$error":"#VALUE!"}},{"$f":"E35-E36","v":0},{"$f":"F35-F36","v":0},null,null,null,{"$f":"J35-J36","v":{"$error":"#VALUE!"}}]
[{"$f":"'WORK SHEET'!D207","v":0},"Period from",null,{"$f":"'WORK SHEET'!C207","v":"00:00:00"},"to",{"$f":"'WORK SHEET'!F207","v":"00:00:00"},null,"Months",null,{"$f":"'WORK SHEET'!I207","v":0},{"$f":"ROUND(C37*J38,0)","v":0},{"$f":"ROUND(D37*J38,0)","v":{"$error":"#VALUE!"}},{"$f":"ROUND(E37*J38,0)","v":0},{"$f":"ROUND(F37*J38,0)","v":0},{"$f":"IF('WORK SHEET'!D94=0,\" \",ROUND(G10*J38,0))","v":" "},{"$f":"IF('WORK SHEET'!D95=0,\" \",ROUND(H10*J38,0))","v":" "},{"$f":"IF('WORK SHEET'!D96=0,\" \",ROUND(I10*J38,0))","v":" "},{"$f":"SUM(K38:Q38)","v":{"$error":"#VALUE!"}}]
[{"$f":"CONCATENATE('WORK SHEET'!L208,\"%\")","v":"%"},"T.D.",{"$f":"'WORK SHEET'!E208","v":0},{"$f":"ROUND(C39*A39,0)","v":{"$error":"#VALUE!"}},{"$f":"ROUND(C39*'WORK SHEET'!N188/100,0)","v":0},0,null,null,null,{"$f":"SUM(C39:I39)","v":{"$error":"#VALUE!"}}]
[{"$f":"CONCATENATE('WORK SHEET'!K208,\"%\")","v":"%"},"A.D.",{"$f":"'WORK SHEET'!M208","v":0},{"$f":"ROUND(C40*A40,0)","v":{"$error":"#VALUE!"}},{"$f":"ROUND(C40*'WORK SHEET'!N188/100,0)","v":0},{"$f":"ROUND(C40*IF(D42<39722,0,IF(D42<39814,15,22))/100,0)","v":0},null,null,null,{"$f":"SUM(C40:I40)","v":{"$error":"#VALUE!"}}]
[{"$f":"CONCATENATE(\"HRA \",'WORK SHEET'!J208,\"%\")","v":"HRA %"},"DIF.",{"$f":"C39-C40","v":0},{"$f":"D39-D40","v":{"$error":"#VALUE!"}},{"$f":"E39-E40","v":0},{"$f":"F39-F40","v":0},null,null,null,{"$f":"J39-J40","v":{"$error":"#VALUE!"}}]
[{"$f":"'WORK SHEET'!D208","v":0},"Period from",null,{"$f":"'WORK SHEET'!C208","v":"00:00:00"},"to",{"$f":"'WORK SHEET'!F208","v":"00:00:00"},null,"Months",null,{"$f":"'WORK SHEET'!I208","v":0},{"$f":"ROUND(C41*J42,0)","v":0},{"$f":"ROUND(D41*J42,0)","v":{"$error":"#VALUE!"}},{"$f":"ROUND(E41*J42,0)","v":0},{"$f":"ROUND(F41*J42,0)","v":0},{"$f":"IF('WORK SHEET'!D94=0,\" \",ROUND(G10*J42,0))","v":" "},{"$f":"IF('WORK SHEET'!D95=0,\" \",ROUND(H10*J42,0))","v":" "},{"$f":"IF('WORK SHEET'!D96=0,\" \",ROUND(I10*J42,0))","v":" "},{"$f":"SUM(K42:Q42)","v":{"$error":"#VALUE!"}}]
[{"$f":"CONCATENATE('WORK SHEET'!L209,\"%\")","v":"%"},"T.D.",{"$f":"'WORK SHEET'!E209","v":0},{"$f":"ROUND(C43*A43,0)","v":{"$error":"#VALUE!"}},{"$f":"ROUND(C43*'WORK SHEET'!N189/100,0)","v":0},0,null,null,null,{"$f":"SUM(C43:I43)","v":{"$error":"#VALUE!"}}]
[{"$f":"CONCATENATE('WORK SHEET'!K209,\"%\")","v":"%"},"A.D.",{"$f":"'WORK SHEET'!M209","v":0},{"$f":"ROUND(C44*A44,0)","v":{"$error":"#VALUE!"}},{"$f":"ROUND(C44*'WORK SHEET'!N189/100,0)","v":0},{"$f":"ROUND(C44*IF(D46<39722,0,IF(D46<39814,15,22))/100,0)","v":0},null,null,null,{"$f":"SUM(C44:I44)","v":{"$error":"#VALUE!"}}]
[{"$f":"CONCATENATE(\"HRA \",'WORK SHEET'!J209,\"%\")","v":"HRA %"},"DIF.",{"$f":"C43-C44","v":0},{"$f":"D43-D44","v":{"$error":"#VALUE!"}},{"$f":"E43-E44","v":0},{"$f":"F43-F44","v":0},null,null,null,{"$f":"J43-J44","v":{"$error":"#VALUE!"}}]
[{"$f":"'WORK SHEET'!D209","v":0},"Period from",null,{"$f":"'WORK SHEET'!C209","v":"00:00:00"},"to",{"$f":"'WORK SHEET'!F209","v":"00:00:00"},null,"Months",null,{"$f":"'WORK SHEET'!I209","v":0},{"$f":"ROUND(C45*J46,0)","v":0},{"$f":"ROUND(D45*J46,0)","v":{"$error":"#VALUE!"}},{"$f":"ROUND(E45*J46,0)","v":0},{"$f":"ROUND(F45*J46,0)","v":0},{"$f":"IF('WORK SHEET'!D94=0,\" \",ROUND(G10*J46,0))","v":" "},{"$f":"IF('WORK SHEET'!D95=0,\" \",ROUND(H10*J46,0))","v":" "},{"$f":"IF('WORK SHEET'!D96=0,\" \",ROUND(I10*J46,0))","v":" "},{"$f":"SUM(K46:Q46)","v":{"$error":"#VALUE!"}}]
[{"$f":"CONCATENATE('WORK SHEET'!L210,\"%\")","v":"%"},"T.D.",{"$f":"'WORK SHEET'!E210","v":0},{"$f":"ROUND(C47*A47,0)","v":{"$error":"#VALUE!"}},{"$f":"ROUND(C47*'WORK SHEET'!N190/100,0)","v":0},0,null,null,null,{"$f":"SUM(C47:I47)","v":{"$error":"#VALUE!"}}]
[{"$f":"CONCATENATE('WORK SHEET'!K210,\"%\")","v":"%"},"A.D.",{"$f":"'WORK SHEET'!M210","v":0},{"$f":"ROUND(C48*A48,0)","v":{"$error":"#VALUE!"}},{"$f":"ROUND(C48*'WORK SHEET'!N190/100,0)","v":0},{"$f":"ROUND(C48*IF(D50<39722,0,IF(D50<39814,15,22))/100,0)","v":0},null,null,null,{"$f":"SUM(C48:I48)","v":{"$error":"#VALUE!"}}]
[{"$f":"CONCATENATE(\"HRA \",'WORK SHEET'!J210,\"%\")","v":"HRA %"},"DIF.",{"$f":"C47-C48","v":0},{"$f":"D47-D48","v":{"$error":"#VALUE!"}},{"$f":"E47-E48","v":0},{"$f":"F47-F48","v":0},null,null,null,{"$f":"J47-J48","v":{"$error":"#VALUE!"}}]
[{"$f":"'WORK SHEET'!D210","v":0},"Period from",null,{"$f":"'WORK SHEET'!C210","v":"00:00:00"},"to",{"$f":"'WORK SHEET'!F210","v":"00:00:00"},null,"Months",null,{"$f":"'WORK SHEET'!I210","v":0},{"$f":"ROUND(C49*J50,0)","v":0},{"$f":"ROUND(D49*J50,0)","v":{"$error":"#VALUE!"}},{"$f":"ROUND(E49*J50,0)","v":0},{"$f":"ROUND(F49*J50,0)","v":0},{"$f":"IF('WORK SHEET'!D94=0,\" \",ROUND(G10*J50,0))","v":" "},{"$f":"IF('WORK SHEET'!D95=0,\" \",ROUND(H10*J50,0))","v":" "},{"$f":"IF('WORK SHEET'!D96=0,\" \",ROUND(I10*J50,0))","v":" "},{"$f":"SUM(K50:Q50)","v":{"$error":"#VALUE!"}}]
[{"$f":"CONCATENATE('WORK SHEET'!L211,\"%\")","v":"%"},"T.D.",{"$f":"'WORK SHEET'!E211","v":0},{"$f":"ROUND(C51*A51,0)","v":{"$error":"#VALUE!"}},{"$f":"ROUND(C51*'WORK SHEET'!N191/100,0)","v":0},0,null,null,null,{"$f":"SUM(C51:I51)","v":{"$error":"#VALUE!"}}]
[{"$f":"CONCATENATE('WORK SHEET'!K211,\"%\")","v":"%"},"A.D.",{"$f":"'WORK SHEET'!M211","v":0},{"$f":"ROUND(C52*A52,0)","v":{"$error":"#VALUE!"}},{"$f":"ROUND(C52*'WORK SHEET'!N191/100,0)","v":0},{"$f":"ROUND(C52*IF(D54<39722,0,IF(D54<39814,15,22))/100,0)","v":0},null,null,null,{"$f":"SUM(C52:I52)","v":{"$error":"#VALUE!"}}]
[{"$f":"CONCATENATE(\"HRA \",'WORK SHEET'!J211,\"%\")","v":"HRA %"},"DIF.",{"$f":"C51-C52","v":0},{"$f":"D51-D52","v":{"$error":"#VALUE!"}},{"$f":"E51-E52","v":0},{"$f":"F51-F52","v":0},null,null,null,{"$f":"J51-J52","v":{"$error":"#VALUE!"}}]
[{"$f":"'WORK SHEET'!D211","v":0},"Period from",null,{"$f":"'WORK SHEET'!C211","v":"00:00:00"},"to",{"$f":"'WORK SHEET'!F211","v":"00:00:00"},null,"Months",null,{"$f":"'WORK SHEET'!I211","v":0},{"$f":"ROUND(C53*J54,0)","v":0},{"$f":"ROUND(D53*J54,0)","v":{"$error":"#VALUE!"}},{"$f":"ROUND(E53*J54,0)","v":0},{"$f":"ROUND(F53*J54,0)","v":0},{"$f":"IF('WORK SHEET'!D94=0,\" \",ROUND(G10*J54,0))","v":" "},{"$f":"IF('WORK SHEET'!D95=0,\" \",ROUND(H10*J54,0))","v":" "},{"$f":"IF('WORK SHEET'!D96=0,\" \",ROUND(I10*J54,0))","v":" "},{"$f":"SUM(K54:Q54)","v":{"$error":"#VALUE!"}}]
[{"$f":"CONCATENATE('WORK SHEET'!L212,\"%\")","v":"%"},"T.D.",{"$f":"'WORK SHEET'!E212","v":0},{"$f":"ROUND(C55*A55,0)","v":{"$error":"#VALUE!"}},{"$f":"ROUND(C55*'WORK SHEET'!N192/100,0)","v":0},0,null,null,null,{"$f":"SUM(C55:I55)","v":{"$error":"#VALUE!"}}]
[{"$f":"CONCATENATE('WORK SHEET'!K212,\"%\")","v":"%"},"A.D.",{"$f":"'WORK SHEET'!M212","v":0},{"$f":"ROUND(C56*A56,0)","v":{"$error":"#VALUE!"}},{"$f":"ROUND(C56*'WORK SHEET'!N192/100,0)","v":0},{"$f":"ROUND(C56*IF(D58<39722,0,IF(D58<39814,15,22))/100,0)","v":0},null,null,null,{"$f":"SUM(C56:I56)","v":{"$error":"#VALUE!"}}]
[{"$f":"CONCATENATE(\"HRA \",'WORK SHEET'!J212,\"%\")","v":"HRA %"},"DIF.",{"$f":"C55-C56","v":0},{"$f":"D55-D56","v":{"$error":"#VALUE!"}},{"$f":"E55-E56","v":0},{"$f":"F55-F56","v":0},null,null,null,{"$f":"J55-J56","v":{"$error":"#VALUE!"}}]
[{"$f":"'WORK SHEET'!D212","v":0},"Period from",null,{"$f":"'WORK SHEET'!C212","v":"00:00:00"},"to",{"$f":"'WORK SHEET'!F212","v":"00:00:00"},null,"Months",null,{"$f":"'WORK SHEET'!I212","v":0},{"$f":"ROUND(C57*J58,0)","v":0},{"$f":"ROUND(D57*J58,0)","v":{"$error":"#VALUE!"}},{"$f":"ROUND(E57*J58,0)","v":0},{"$f":"ROUND(F57*J58,0)","v":0},{"$f":"IF('WORK SHEET'!D94=0,\" \",ROUND(G10*J58,0))","v":" "},{"$f":"IF('WORK SHEET'!D95=0,\" \",ROUND(H10*J58,0))","v":" "},{"$f":"IF('WORK SHEET'!D96=0,\" \",ROUND(I10*J58,0))","v":" "},{"$f":"SUM(K58:Q58)","v":{"$error":"#VALUE!"}}]
[{"$f":"CONCATENATE('WORK SHEET'!L213,\"%\")","v":"%"},"T.D.",{"$f":"'WORK SHEET'!E2080","v":0},{"$f":"ROUND(C59*A59,0)","v":{"$error":"#VALUE!"}},{"$f":"ROUND(C59*'WORK SHEET'!N193/100,0)","v":0},0,null,null,null,{"$f":"SUM(C59:I59)","v":{"$error":"#VALUE!"}}]
[{"$f":"CONCATENATE('WORK SHEET'!K213,\"%\")","v":"%"},"A.D.",{"$f":"'WORK SHEET'!M213","v":0},{"$f":"ROUND(C60*A60,0)","v":{"$error":"#VALUE!"}},{"$f":"ROUND(C60*'WORK SHEET'!N193/100,0)","v":0},{"$f":"ROUND(C60*IF(D62<39722,0,IF(D62<39814,15,22))/100,0)","v":0},null,null,null,{"$f":"SUM(C60:I60)","v":{"$error":"#VALUE!"}}]
[{"$f":"CONCATENATE(\"HRA \",'WORK SHEET'!J213,\"%\")","v":"HRA %"},"DIF.",{"$f":"C59-C60","v":0},{"$f":"D59-D60","v":{"$error":"#VALUE!"}},{"$f":"E59-E60","v":0},{"$f":"F59-F60","v":0},null,null,null,{"$f":"J59-J60","v":{"$error":"#VALUE!"}}]
[{"$f":"'WORK SHEET'!D213","v":0},"Period from",null,{"$f":"'WORK SHEET'!C213","v":"00:00:00"},"to",{"$f":"'WORK SHEET'!F213","v":"00:00:00"},null,"Months",null,{"$f":"'WORK SHEET'!I213","v":0},{"$f":"ROUND(C61*J62,0)","v":0},{"$f":"ROUND(D61*J62,0)","v":{"$error":"#VALUE!"}},{"$f":"ROUND(E61*J62,0)","v":0},{"$f":"ROUND(F61*J62,0)","v":0},{"$f":"IF('WORK SHEET'!D94=0,\" \",ROUND(G10*J61,0))","v":" "},{"$f":"IF('WORK SHEET'!D95=0,\" \",ROUND(H10*J62,0))","v":" "},{"$f":"IF('WORK SHEET'!D96=0,\" \",ROUND(I10*J62,0))","v":" "},{"$f":"SUM(K62:Q62)","v":{"$error":"#VALUE!"}}]
[null,null,null,null,null,null,null,"TOTAL",null,null,{"$f":"SUM(K34:K62)","v":0},{"$f":"SUM(L34:L62)","v":{"$error":"#VALUE!"}},0,0,0,0,0,{"$error":"#VALUE!"}]

{"sheet":"BILL-P.F & CASH","index":8,"n_rows":41,"n_cols":22,"rows_kept":41,"cut":false,"hidden":true,"merged":[[29,7,29,8],[40,0,40,21],[30,1,30,2],[35,2,35,9],[33,0,33,21],[31,0,31,21],[34,2,34,9],[39,2,39,9],[36,2,36,9],[37,2,37,9],[38,2,38,9],[30,5,30,6],[30,7,30,8],[29,1,29,2],[29,5,29,6],[21,1,21,2],[21,5,21,6],[21,7,21,8],[25,1,25,2],[25,5,25,6],[25,7,25,8],[0,20,0,21],[1,2,1,9],[2,2,2,9],[5,2,5,9],[10,1,10,2],[10,5,10,6],[10,7,10,8],[16,17,16,18],[16,10,16,13],[16,15,16,16],[15,5,15,6],[0,0,0,19],[14,1,14,2],[14,5,14,6],[14,7,14,8]]}
[{"$f":"CONCATENATE(\"PRC-10 ARREAR OF \",'WORK SHEET'!E2,\", \",'WORK SHEET'!E54,\", \",'WORK SHEET'!E3,\", \",'WORK SHEET'!E4,\", \",'WORK SHEET'!E5,\" MANDAL\",\" FROM 01-07-2008 To\")","v":"PRC-10 ARREAR OF SK.KHAJARAHAMTULLA, , MPPS(G), POTLAPADU, KURICHEDU MANDAL FROM 01-07-2008 To"},null,null,null,null,null,null,null,null,null,null,null,null,null,null,null,null,null,null,null,{"$f":"P17","v":"2011-07-30T00:14:24"}]
[null,"Sl.No","Name and Designation",null,null,null,null,null,null,null,"Pay","D.A","H.R.A","I.R",{"$f":"IF('WORK SHEET'!D94=0,\" \",'WORK SHEET'!E94)","v":" "},{"$f":"IF('WORK SHEET'!D95=0,\" \",'WORK SHEET'!E95)","v":" "},null,"Grand Total","G.P.F.","Z.P.P.F","Govt Deductions","Net "]
[null,1,2,null,null,null,null,null,null,null,3,4,5,6,7,8,9,10,11,12,13,14]
[null,null,null,null,null,null,null,null,null,null,"PART -II ( Credited to P.F. from 01-02-2010 to 28-02-2010 ( 1 Month)"]
[{"$f":"'BILL-NOTIONAL'!A5","v":724731},1,{"$f":"'WORK SHEET'!E2","v":"SK.KHAJARAHAMTULLA"},null,null,null,null,null,{"$f":"'WORK SHEET'!E54","v":0}]
[null,null,{"$f":"'BILL-NOTIONAL'!C6:J6","v":{"$error":"#REF!"}}]
[null,null,"PAY","D.A.","H.R.A.","I.R",null,null,null,"TOTAL"]
[{"$f":"CONCATENATE('WORK SHEET'!L222,\"%\")","v":"%"},"T.D.",{"$f":"'WORK SHEET'!E222","v":0},{"$f":"ROUND(C8*A8,0)","v":{"$error":"#VALUE!"}},{"$f":"ROUND(C8*'WORK SHEET'!J222/100,0)","v":0},0,null,null,null,{"$f":"SUM(C8:I8)","v":{"$error":"#VALUE!"}}]
[{"$f":"CONCATENATE('WORK SHEET'!K222,\"%\")","v":"%"},"A.D.",{"$f":"'WORK SHEET'!M222","v":0},{"$f":"ROUND(C9*A9,0)","v":{"$error":"#VALUE!"}},{"$f":"ROUND(C9*'WORK SHEET'!J222/100,0)","v":0},{"$f":"ROUND(C9*22/100,0)","v":0},null,null,null,{"$f":"SUM(C9:I9)","v":{"$error":"#VALUE!"}}]
[{"$f":"CONCATENATE(\"HRA \",'WORK SHEET'!J222,\"%\")","v":"HRA %"},"DIF.",{"$f":"C8-C9","v":0},{"$f":"D8-D9","v":{"$error":"#VALUE!"}},{"$f":"E8-E9","v":0},{"$f":"F8-F9","v":0},null,null,null,{"$f":"J8-J9","v":{"$error":"#VALUE!"}}]
[null,"Period from",null,{"$f":"'WORK SHEET'!C222","v":"00:00:00"},"to",{"$f":"'WORK SHEET'!F222","v":"00:00:00"},null,"Months",null,{"$f":"'WORK SHEET'!I222","v":0},{"$f":"ROUND(C10*J11,0)","v":0},{"$f":"ROUND(D10*J11,0)","v":{"$error":"#VALUE!"}},{"$f":"ROUND(E10*J11,0)","v":0},{"$f":"ROUND(F10*J11,0)","v":0},{"$f":"IF('WORK SHEET'!D94=0,\" \",ROUND(G10*J11,0))","v":" "},{"$f":"IF('WORK SHEET'!D95=0,\" \",ROUND(H10*J11,0))","v":" "},{"$f":"IF('WORK SHEET'!D96=0,\" \",ROUND(I10*J11,0))","v":" "},{"$f":"SUM(K11:Q11)","v":{"$error":"#VALUE!"}},{"$f":"IF('WORK SHEET'!E120=1,R11,\" \")","v":" "},{"$f":"IF('WORK SHEET'!E120=2,R11,\" \")","v":{"$error":"#VALUE!"}},{"$f":"SUM(S11:T11)","v":{"$error":"#VALUE!"}},{"$f":"R11-U11","v":{"$error":"#VALUE!"}}]
[{"$f":"CONCATENATE('WORK SHEET'!L223,\"%\")","v":"%"},"T.D.",{"$f":"'WORK SHEET'!E223","v":0},{"$f":"ROUND(C12*A12,0)","v":{"$error":"#VALUE!"}},{"$f":"ROUND(C12*'WORK SHEET'!J223/100,0)","v":0},0,null,null,null,{"$f":"SUM(C12:I12)","v":{"$error":"#VALUE!"}}]
[{"$f":"CONCATENATE('WORK SHEET'!K223,\"%\")","v":"%"},"A.D.",{"$f":"'WORK SHEET'!M223","v":0},{"$f":"ROUND(C13*A13,0)","v":{"$error":"#VALUE!"}},{"$f":"ROUND(C13*'WORK SHEET'!J223/100,0)","v":0},{"$f":"ROUND(C13*22/100,0)","v":0},null,null,null,{"$f":"SUM(C13:I13)","v":{"$error":"#VALUE!"}}]
[{"$f":"CONCATENATE(\"HRA \",'WORK SHEET'!J223,\"%\")","v":"HRA %"},"DIF.",{"$f":"C12-C13","v":0},{"$f":"D12-D13","v":{"$error":"#VALUE!"}},{"$f":"E12-E13","v":0},{"$f":"F12-F13","v":0},null,null,null,{"$f":"J12-J13","v":{"$error":"#VALUE!"}}]
[null,"Period from",null,{"$f":"'WORK SHEET'!C223","v":"00:00:00"},"to",{"$f":"'WORK SHEET'!F223","v":"00:00:00"},null,"Months",null,{"$f":"'WORK SHEET'!I223","v":0},{"$f":"ROUND(C14*J15,0)","v":0},{"$f":"ROUND(D14*J15,0)","v":{"$error":"#VALUE!"}},{"$f":"ROUND(E14*J15,0)","v":0},{"$f":"ROUND(F14*J15,0)","v":0},{"$f":"IF('WORK SHEET'!D94=0,\" \",ROUND(G10*J15,0))","v":" "},{"$f":"IF('WORK SHEET'!D95=0,\" \",ROUND(H10*J15,0))","v":" "},{"$f":"IF('WORK SHEET'!D96=0,\" \",ROUND(I10*J15,0))","v":" "},{"$f":"SUM(K15:Q15)","v":{"$error":"#VALUE!"}},{"$f":"IF('WORK SHEET'!E120=1,R15,\" \")","v":" "},{"$f":"IF('WORK SHEET'!E120=2,R15,\" \")","v":{"$error":"#VALUE!"}},{"$f":"SUM(S15:T15)","v":{"$error":"#VALUE!"}},{"$f":"R15-U15","v":{"$error":"#VALUE!"}}]
[null,null,null,null,null,"TOTAL",null,null,null,null,{"$f":"SUM(K11:K15)","v":0},{"$error":"#VALUE!"},0,0,0,0,0,{"$f":"SUM(R11:R15)","v":{"$error":"#VALUE!"}},0,{"$error":"#VALUE!"},{"$error":"#VALUE!"},{"$error":"#VALUE!"}]
[null,null,null,null,null,null,null,null,null,null,"PART - III ( CASH  FROM   01-03-2010 ",null,null,null,"to",{"$f":"'WORK SHEET'!E135","v":"2011-07-30T00:14:24"},null,{"$f":"CONCATENATE(\"(\",(J22+J26+J30),\" \",\"Months\",\")\",)","v":"(0 Months)"}]
[null,null,"PAY","D.A.","H.R.A.","I.R",{"$f":"IF('WORK SHEET'!D94=0,\" \",'WORK SHEET'!E94)","v":" "},{"$f":"IF('WORK SHEET'!D95=0,\" \",'WORK SHEET'!E95)","v":" "},{"$f":"IF('WORK SHEET'!D96=0,\" \",'WORK SHEET'!E96)","v":" "},"TOTAL"]
[{"$f":"CONCATENATE('WORK SHEET'!L234,\"%\")","v":"%"},"T.D.",{"$f":"'WORK SHEET'!E234","v":0},{"$f":"ROUND(C19*A19,0)","v":{"$error":"#VALUE!"}},{"$f":"ROUND(C19*'WORK SHEET'!J234/100,0)","v":0},0,null,null,null,{"$f":"SUM(C19:I19)","v":{"$error":"#VALUE!"}}]
[{"$f":"CONCATENATE('WORK SHEET'!K234,\"%\")","v":"%"},"A.D.",{"$f":"'WORK SHEET'!M234","v":0},{"$f":"ROUND(C20*A20,0)","v":{"$error":"#VALUE!"}},{"$f":"ROUND(C20*'WORK SHEET'!J234/100,0)","v":0},{"$f":"ROUND(C20*22/100,0)","v":0},null,null,null,{"$f":"SUM(C20:I20)","v":{"$error":"#VALUE!"}}]
[{"$f":"CONCATENATE(\"HRA \",'WORK SHEET'!J234,\"%\")","v":"HRA %"},"DIF.",{"$f":"C19-C20","v":0},{"$f":"D19-D20","v":{"$error":"#VALUE!"}},{"$f":"E19-E20","v":0},{"$f":"F19-F20","v":0},null,null,null,{"$f":"J19-J20","v":{"$error":"#VALUE!"}}]
[{"$f":"'WORK SHEET'!D201","v":0},"Period from",null,{"$f":"'WORK SHEET'!C234","v":"00:00:00"},"to",{"$f":"'WORK SHEET'!F234","v":"00:00:00"},null,"Months",null,{"$f":"'WORK SHEET'!I234","v":0},{"$f":"ROUND(C21*J22,0)","v":0},{"$f":"ROUND(D21*J22,0)","v":{"$error":"#VALUE!"}},{"$f":"ROUND(E21*J22,0)","v":0},{"$f":"ROUND(F21*J22,0)","v":0},{"$f":"IF('WORK SHEET'!D94=0,\" \",ROUND(G21*J22,0))","v":" "},{"$f":"IF('WORK SHEET'!D95=0,\" \",ROUND(H21*J22,0))","v":" "},{"$f":"IF('WORK SHEET'!D96=0,\" \",ROUND(I21*J22,0))","v":" "},{"$f":"SUM(K22:Q22)","v":{"$error":"#VALUE!"}},null,null,0,{"$f":"R22-U22","v":{"$error":"#VALUE!"}}]
[{"$f":"CONCATENATE('WORK SHEET'!L235,\"%\")","v":"%"},"T.D.",{"$f":"'WORK SHEET'!E235","v":0},{"$f":"ROUND(C23*A23,0)","v":{"$error":"#VALUE!"}},{"$f":"ROUND(C23*'WORK SHEET'!J235/100,0)","v":0},0,{"$f":"IF(D26=40269,IF('WORK SHEET'!D94=0,\" \",IF(C23=0,0,IF('WORK SHEET'!D94=5,'WORK SHEET'!F115,'WORK SHEET'!G94))),\" \")","v":" "},{"$f":"IF(D26=40269,IF('WORK SHEET'!D95=0,\" \",IF(C23=0,0,IF('WORK SHEET'!D95=5,'WORK SHEET'!F115,'WORK SHEET'!G95))),\" \")","v":" "},{"$f":"IF(D26=40269,IF('WORK SHEET'!D96=0,\" \",IF(C23=0,0,IF('WORK SHEET'!D96=5,'WORK SHEET'!F115,'WORK SHEET'!G96))),\" \")","v":" "},{"$f":"SUM(C23:I23)","v":{"$error":"#VALUE!"}}]
[{"$f":"CONCATENATE('WORK SHEET'!K235,\"%\")","v":"%"},"A.D.",{"$f":"'WORK SHEET'!M235","v":0},{"$f":"ROUND(C24*A24,0)","v":{"$error":"#VALUE!"}},{"$f":"ROUND(C24*'WORK SHEET'!J235/100,0)","v":0},{"$f":"ROUND(C24*22/100,0)","v":0},{"$f":"IF(D26=40269,IF('WORK SHEET'!D94=0,\" \",IF(C23=0,0,IF('WORK SHEET'!D94=1,MIN(ROUND(C24*10%,0),'WORK SHEET'!F94),IF('WORK SHEET'!D94=5,'WORK SHEET'!J115,'WORK SHEET'!F94)))),\" \")","v":" "},{"$f":"IF(D26=40269,IF('WORK SHEET'!D95=0,\" \",IF(C23=0,0,IF('WORK SHEET'!D95=1,MIN(ROUND(C24*10%,0),'WORK SHEET'!F95),IF('WORK SHEET'!D95=5,'WORK SHEET'!J115,'WORK SHEET'!F95)))),\" \")","v":" "},{"$f":"IF(D26=40269,IF('WORK SHEET'!D96=0,\" \",IF(C23=0,0,IF('WORK SHEET'!D96=1,MIN(ROUND(C24*10%,0),'WORK SHEET'!F96),IF('WORK SHEET'!D96=5,'WORK SHEET'!J115,'WORK SHEET'!F96)))),\" \")","v":" "},{"$f":"SUM(C24:I24)","v":{"$error":"#VALUE!"}}]
[{"$f":"CONCATENATE(\"HRA \",'WORK SHEET'!J235,\"%\")","v":"HRA %"},"DIF.",{"$f":"C23-C24","v":0},{"$f":"D23-D24","v":{"$error":"#VALUE!"}},{"$f":"E23-E24","v":0},{"$f":"F23-F24","v":0},{"$f":"IF('WORK SHEET'!D94=0,\" \",G23-G24)","v":" "},{"$f":"IF('WORK SHEET'!D95=0,\" \",H23-H24)","v":" "},{"$f":"IF('WORK SHEET'!D96=0,\" \",I23-I24)","v":" "},{"$f":"J23-J24","v":{"$error":"#VALUE!"}}]
[{"$f":"'WORK SHEET'!D202","v":0},"Period from",null,{"$f":"'WORK SHEET'!C235","v":"00:00:00"},"to",{"$f":"'WORK SHEET'!F235","v":"00:00:00"},null,"Months",null,{"$f":"'WORK SHEET'!I235","v":0},{"$f":"ROUND(C25*J26,0)","v":0},{"$f":"ROUND(D25*J26,0)","v":{"$error":"#VALUE!"}},{"$f":"ROUND(E25*J26,0)","v":0},{"$f":"ROUND(F25*J26,0)","v":0},{"$f":"IF('WORK SHEET'!D94=0,\" \",ROUND(G25*J26,0))","v":" "},{"$f":"IF('WORK SHEET'!D95=0,\" \",ROUND(H25*J26,0))","v":" "},{"$f":"IF('WORK SHEET'!D96=0,\" \",ROUND(I25*J26,0))","v":" "},{"$f":"SUM(K26:Q26)","v":{"$error":"#VALUE!"}},null,null,0,{"$f":"R26-U26","v":{"$error":"#VALUE!"}}]
[{"$f":"CONCATENATE('WORK SHEET'!L236,\"%\")","v":"%"},"T.D.",{"$f":"'WORK SHEET'!E236","v":0},{"$f":"ROUND(C27*A27,0)","v":{"$error":"#VALUE!"}},{"$f":"ROUND(C27*'WORK SHEET'!J236/100,0)","v":0},0,{"$f":"IF('WORK SHEET'!D94=0,\" \",IF(C27=0,0,IF('WORK SHEET'!D94=5,'WORK SHEET'!F119,'WORK SHEET'!G98)))","v":" "},{"$f":"IF('WORK SHEET'!D95=0,\" \",IF(C27=0,0,IF('WORK SHEET'!D95=5,'WORK SHEET'!F119,'WORK SHEET'!G95)))","v":" "},{"$f":"IF('WORK SHEET'!D96=0,\" \",IF(C27=0,0,IF('WORK SHEET'!D96=5,'WORK SHEET'!F119,'WORK SHEET'!G96)))","v":" "},{"$f":"SUM(C27:I27)","v":{"$error":"#VALUE!"}}]
[{"$f":"CONCATENATE('WORK SHEET'!K236,\"%\")","v":"%"},"A.D.",{"$f":"'WORK SHEET'!M236","v":0},{"$f":"ROUND(C28*A28,0)","v":{"$error":"#VALUE!"}},{"$f":"ROUND(C28*'WORK SHEET'!J236/100,0)","v":0},{"$f":"ROUND(C28*22/100,0)","v":0},{"$f":"IF('WORK SHEET'!D94=0,\" \",IF(C27=0,0,IF('WORK SHEET'!D94=1,MIN(ROUND(C28*10%,0),'WORK SHEET'!F94),IF('WORK SHEET'!D94=5,'WORK SHEET'!J119,'WORK SHEET'!F94))))","v":" "},{"$f":"IF('WORK SHEET'!D95=0,\" \",IF(C27=0,0,IF('WORK SHEET'!D95=1,MIN(ROUND(C28*10%,0),'WORK SHEET'!F95),IF('WORK SHEET'!D95=5,'WORK SHEET'!J119,'WORK SHEET'!F95))))","v":" "},{"$f":"IF('WORK SHEET'!D96=0,\" \",IF(C27=0,0,IF('WORK SHEET'!D96=1,MIN(ROUND(C28*10%,0),'WORK SHEET'!F96),IF('WORK SHEET'!D96=5,'WORK SHEET'!J119,'WORK SHEET'!F96))))","v":" "},{"$f":"SUM(C28:I28)","v":{"$error":"#VALUE!"}}]
[{"$f":"CONCATENATE(\"HRA \",'WORK SHEET'!J236,\"%\")","v":"HRA %"},"DIF.",{"$f":"C27-C28","v":0},{"$f":"D27-D28","v":{"$error":"#VALUE!"}},{"$f":"E27-E28","v":0},{"$f":"F27-F28","v":0},{"$f":"IF('WORK SHEET'!D94=0,\" \",G27-G28)","v":" "},{"$f":"IF('WORK SHEET'!D95=0,\" \",H27-H28)","v":" "},{"$f":"IF('WORK SHEET'!D96=0,\" \",I27-I28)","v":" "},{"$f":"J27-J28","v":{"$error":"#VALUE!"}}]
[{"$f":"'WORK SHEET'!D206","v":0},"Period from",null,{"$f":"'WORK SHEET'!C236","v":"00:00:00"},"to",{"$f":"'WORK SHEET'!F236","v":"00:00:00"},null,"Months",null,{"$f":"'WORK SHEET'!I239","v":0},{"$f":"ROUND(C29*J30,0)","v":0},{"$f":"ROUND(D29*J30,0)","v":{"$error":"#VALUE!"}},{"$f":"ROUND(E29*J30,0)","v":0},{"$f":"ROUND(F29*J30,0)","v":0},{"$f":"IF('WORK SHEET'!D98=0,\" \",ROUND(G29*J30,0))","v":" "},{"$f":"IF('WORK SHEET'!D99=0,\" \",ROUND(H29*J30,0))","v":" "},{"$f":"IF('WORK SHEET'!D100=0,\" \",ROUND(I29*J30,0))","v":" "},{"$f":"SUM(K30:Q30)","v":{"$error":"#VALUE!"}},null,null,0,{"$f":"R30-U30","v":{"$error":"#VALUE!"}}]
[null,null,null,null,null,null,null,"TOTAL",null,null,{"$f":"SUM(K18:K26)","v":0},{"$error":"#VALUE!"},0,0,0,0,0,{"$error":"#VALUE!"},0,0,0,{"$error":"#VALUE!"}]
[{"$f":"'WORK SHEET'!AJ142","v":"RUPEES : ONE THOUSAND ONE HUNDRED AND NINETY FOUR  ONLY"}]
[]
["CONSOLIDATION"]
[null,"Sl.No","BILL PART",null,null,null,null,null,null,null,"Pay","D.A","H.R.A","I.R","CCA","H.M.A",null,"Grand Total","G.P.F.","Z.P.P.F","Govt Deductions","Net Salary"]
[null,1,2,null,null,null,null,null,null,null,3,4,5,6,7,8,9,10,11,12,13,14]
[null,null,"PART - I ( NOTIONAL )",null,null,null,null,null,null,null,{"$f":"'BILL-NOTIONAL'!K63","v":0},{"$f":"'BILL-NOTIONAL'!L63","v":{"$error":"#VALUE!"}},{"$f":"'BILL-NOTIONAL'!M63","v":0},{"$f":"'BILL-NOTIONAL'!N63","v":0},{"$f":"'BILL-NOTIONAL'!O63","v":0},{"$f":"'BILL-NOTIONAL'!P63","v":0},{"$f":"'BILL-NOTIONAL'!Q63","v":0},{"$f":"'BILL-NOTIONAL'!R63","v":{"$error":"#VALUE!"}},{"$f":"'BILL-NOTIONAL'!S63","v":0},{"$f":"'BILL-NOTIONAL'!S63","v":0},0,0]
[null,null,"PART - II ( P.F. ADJESTMENT )",null,null,null,null,null,null,null,{"$f":"SUM(BILL!AA26:AA26)","v":0},{"$f":"SUM(BILL!AB26:AB26)","v":0},{"$f":"SUM(BILL!AC26:AC26)","v":0},{"$f":"0","v":0},{"$f":"'BILL-P.F & CASH'!O16","v":0},{"$f":"'BILL-P.F & CASH'!P16","v":0},{"$f":"'BILL-P.F & CASH'!Q16","v":0},{"$f":"SUM(BILL!AH26:AH26)","v":0},{"$f":"IF('WORK SHEET'!E120=1,SUM(BILL!AH26:AH26),0)","v":0},{"$f":"IF('WORK SHEET'!E120=2,SUM(BILL!AH26:AH26),0)","v":0},{"$f":"S38+T38","v":0},{"$f":"'BILL-P.F & CASH'!V16","v":{"$error":"#VALUE!"}}]
[null,null,"PART - III ( CASH )",null,null,null,null,null,null,null,{"$f":"SUM(BILL!AA30:AA34)","v":1319},{"$f":"SUM(BILL!AB30:AB34)","v":395},{"$f":"SUM(BILL!AC30:AC34)","v":159},{"$f":"0","v":0},{"$f":"SUM(BILL!AD30:AD34)","v":0},{"$f":"SUM(BILL!AF30:AF34)","v":0},{"$f":"SUM(BILL!AG30:AG34)","v":{"$error":"#N/A"}},{"$f":"SUM(BILL!AH30:AH34)","v":1194},{"$f":"S31","v":0},{"$f":"T31","v":0},{"$f":"U31","v":0},{"$f":"R39","v":1194}]
[null,null,"TOTAL ( PART - II & PART - III )",null,null,null,null,null,null,null,{"$f":"K38+K39","v":1319},395,159,0,0,0,{"$error":"#N/A"},1194,0,0,{"$f":"U38+U39+BILL!#REF!","v":{"$error":"#REF!"}},{"$f":"SUM(BILL!AH30:AH34)","v":1194}]
[{"$f":"A32","v":"RUPEES : ONE THOUSAND ONE HUNDRED AND NINETY FOUR  ONLY"}]

{"sheet":"BILL","index":9,"n_rows":42,"n_cols":34,"rows_kept":42,"cut":false,"hidden":false,"merged":[[38,1,38,25],[0,1,0,33],[28,3,28,20],[1,3,1,33],[2,3,2,4],[2,6,2,15],[2,16,2,25],[2,26,2,33],[2,5,3,5],[37,1,37,25]]}
[null,{"$f":"CONCATENATE(\"Claim for pay fixcation arrear in the Automatec Advacement Sceme of \",'WORK SHEET'!E2,\" \",PROCEEDINGS!G19,\" \",'WORK SHEET'!E3,\" \",'WORK SHEET'!E4)","v":"Claim for pay fixcation arrear in the Automatec Advacement Sceme of SK.KHAJARAHAMTULLA S.G.T. MPPS(G) POTLAPADU"}]
[]
[null,null,null,"Period",null,"Days","Eligible",null,null,null,null,null,null,null,null,null,"Already drawn",null,null,null,null,null,null,null,null,null,"Difference"]
[null,"D.A.%","H.R.A%","From","To",null,"B Pay","P.P.","F.P","D A","HRA",null,null,"P.T",{"$f":"IF('WORK SHEET'!D96=0,0,'WORK SHEET'!E96)","v":0},"Total","B Pay","P.P.","F.P.","D A","HRA",null,null,"P.T",{"$f":"O4","v":0},"Total","B Pay","D A","HRA",{"$f":"V4","v":0},null,{"$f":"X4","v":"P.T"},{"$f":"Y4","v":0},"Total"]
[null,{"$f":"'WORK SHEET'!H277","v":16.263999999999999},{"$f":"'WORK SHEET'!J277","v":10},{"$f":"'WORK SHEET'!C277","v":"2010-02-01"},{"$f":"'WORK SHEET'!E277","v":"2010-02-28"},{"$f":"'WORK SHEET'!D277","v":28},{"$f":"'WORK SHEET'!O277","v":14860},{"$f":"'WORK SHEET'!T277","v":0},{"$f":"'WORK SHEET'!U277","v":0},{"$f":"'WORK SHEET'!R277","v":2417},{"$f":"'WORK SHEET'!S277","v":1486},null,null,{"$f":"IF(P5=0,0,IF(P5<=6000,60,IF(P5<=10000,80,IF(P5<=15000,100,IF(P5<=20000,150,200)))))","v":150},null,{"$f":"IF(OR(D5=0,DAY(D5)<>1),0,IF(DAY(D6)<>1,SUM(G5:M5)+SUM(G6:M6),SUM(G5:M5)))","v":18763},{"$f":"'WORK SHEET'!N277","v":14440},{"$f":"H5","v":0},0,{"$f":"'WORK SHEET'!P277","v":2349},{"$f":"'WORK SHEET'!Q277","v":1444},null,null,{"$f":"IF(Z5=0,0,IF(Z5<=6000,60,IF(Z5<=10000,80,IF(Z5<=15000,100,IF(Z5<=20000,150,200)))))","v":150},null,{"$f":"IF(OR(D5=0,DAY(D5)<>1),0,IF(DAY(D6)<>1,SUM(Q5:W5)+SUM(Q6:W6),SUM(Q5:W5)))","v":18233},{"$f":"G5-Q5","v":420},{"$f":"J5-T5","v":68},{"$f":"K5-U5","v":42},{"$f":"L5-V5","v":0},null,{"$f":"N5-X5","v":0},{"$f":"O5-Y5","v":0},{"$f":"P5-Z5","v":530}]
[null,{"$f":"'WORK SHEET'!H278","v":16.263999999999999},{"$f":"'WORK SHEET'!J278","v":10},{"$f":"'WORK SHEET'!C278","v":"2010-03-01"},{"$f":"'WORK SHEET'!E278","v":"2010-03-31"},{"$f":"'WORK SHEET'!D278","v":31},{"$f":"'WORK SHEET'!O278","v":14860},{"$f":"'WORK SHEET'!T278","v":0},{"$f":"'WORK SHEET'!U278","v":0},{"$f":"'WORK SHEET'!R278","v":2417},{"$f":"'WORK SHEET'!S278","v":1486},null,null,{"$f":"IF(P6=0,0,IF(P6<=6000,60,IF(P6<=10000,80,IF(P6<=15000,100,IF(P6<=20000,150,200)))))","v":150},null,{"$f":"IF(OR(D6=0,DAY(D6)<>1),0,IF(DAY(D7)<>1,SUM(G6:M6)+SUM(G7:M7),SUM(G6:M6)))","v":18763},{"$f":"'WORK SHEET'!N278","v":14440},0,0,{"$f":"'WORK SHEET'!P278","v":2349},{"$f":"'WORK SHEET'!Q278","v":1444},null,null,{"$f":"IF(Z6=0,0,IF(Z6<=6000,60,IF(Z6<=10000,80,IF(Z6<=15000,100,IF(Z6<=20000,150,200)))))","v":150},null,{"$f":"IF(OR(D6=0,DAY(D6)<>1),0,IF(DAY(D7)<>1,SUM(Q6:W6)+SUM(Q7:W7),SUM(Q6:W6)))","v":18233},420,68,42,0,null,0,0,530]
[null,{"$f":"'WORK SHEET'!H279","v":16.263999999999999},{"$f":"'WORK SHEET'!J279","v":10},{"$f":"'WORK SHEET'!C279","v":"2010-04-01"},{"$f":"'WORK SHEET'!E279","v":"2010-04-30"},{"$f":"'WORK SHEET'!D279","v":30},{"$f":"'WORK SHEET'!O279","v":14860},{"$f":"'WORK SHEET'!T279","v":0},{"$f":"'WORK SHEET'!U279","v":0},{"$f":"'WORK SHEET'!R279","v":2417},{"$f":"'WORK SHEET'!S279","v":1486},null,null,150,null,18763,{"$f":"'WORK SHEET'!N279","v":14440},0,0,{"$f":"'WORK SHEET'!P279","v":2349},{"$f":"'WORK SHEET'!Q279","v":1444},null,null,150,null,18233,420,68,42,0,null,0,0,530]
[null,{"$f":"'WORK SHEET'!H280","v":16.263999999999999},{"$f":"'WORK SHEET'!J280","v":10},{"$f":"'WORK SHEET'!C280","v":"2010-05-01"},{"$f":"'WORK SHEET'!E280","v":"2010-05-31"},{"$f":"'WORK SHEET'!D280","v":31},{"$f":"'WORK SHEET'!O280","v":14860},{"$f":"'WORK SHEET'!T280","v":0},{"$f":"'WORK SHEET'!U280","v":0},{"$f":"'WORK SHEET'!R280","v":2417},{"$f":"'WORK SHEET'!S280","v":1486},null,null,150,null,18763,{"$f":"'WORK SHEET'!N280","v":14440},0,0,{"$f":"'WORK SHEET'!P280","v":2349},{"$f":"'WORK SHEET'!Q280","v":1444},null,null,150,null,18233,420,68,42,0,null,0,0,530]
[null,{"$f":"'WORK SHEET'!H281","v":16.263999999999999},{"$f":"'WORK SHEET'!J281","v":10},{"$f":"'WORK SHEET'!C281","v":"2010-06-01"},{"$f":"'WORK SHEET'!E281","v":"2010-06-30"},{"$f":"'WORK SHEET'!D281","v":30},{"$f":"'WORK SHEET'!O281","v":14860},{"$f":"'WORK SHEET'!T281","v":0},{"$f":"'WORK SHEET'!U281","v":0},{"$f":"'WORK SHEET'!R281","v":2417},{"$f":"'WORK SHEET'!S281","v":1486},null,null,150,null,18763,{"$f":"'WORK SHEET'!N281","v":14440},{"$f":"H9","v":0},{"$f":"I9","v":0},{"$f":"'WORK SHEET'!P281","v":2349},{"$f":"'WORK SHEET'!Q281","v":1444},null,null,150,null,18233,420,68,42,0,null,0,0,530]
[null,{"$f":"'WORK SHEET'!H282","v":24.824000000000002},{"$f":"'WORK SHEET'!J282","v":10},{"$f":"'WORK SHEET'!C282","v":"2010-07-01"},{"$f":"'WORK SHEET'!E282","v":"2010-07-31"},{"$f":"'WORK SHEET'!D282","v":31},{"$f":"'WORK SHEET'!O282","v":14860},{"$f":"'WORK SHEET'!T282","v":0},{"$f":"'WORK SHEET'!U282","v":0},{"$f":"'WORK SHEET'!R282","v":3689},{"$f":"'WORK SHEET'!S282","v":1486},null,null,200,null,20035,{"$f":"'WORK SHEET'!N282","v":14440},0,0,{"$f":"'WORK SHEET'!P282","v":3585},{"$f":"'WORK SHEET'!Q282","v":1444},null,null,150,null,19469,420,104,42,0,null,50,0,566]
[null,{"$f":"'WORK SHEET'!H283","v":24.824000000000002},{"$f":"'WORK SHEET'!J283","v":10},{"$f":"'WORK SHEET'!C283","v":"2010-08-01"},{"$f":"'WORK SHEET'!E283","v":"2010-08-31"},{"$f":"'WORK SHEET'!D283","v":31},{"$f":"'WORK SHEET'!O283","v":15280},{"$f":"'WORK SHEET'!T283","v":0},{"$f":"'WORK SHEET'!U283","v":0},{"$f":"'WORK SHEET'!R283","v":3793},{"$f":"'WORK SHEET'!S283","v":1528},null,null,200,null,20601,{"$f":"'WORK SHEET'!N283","v":14860},0,0,{"$f":"'WORK SHEET'!P283","v":3689},{"$f":"'WORK SHEET'!Q283","v":1486},null,null,200,null,20035,420,104,42,0,null,0,0,566]
[null,{"$f":"'WORK SHEET'!H284","v":24.824000000000002},{"$f":"'WORK SHEET'!J284","v":10},{"$f":"'WORK SHEET'!C284","v":"2010-09-01"},{"$f":"'WORK SHEET'!E284","v":"2010-09-30"},{"$f":"'WORK SHEET'!D284","v":30},{"$f":"'WORK SHEET'!O284","v":15280},{"$f":"'WORK SHEET'!T284","v":0},{"$f":"'WORK SHEET'!U284","v":0},{"$f":"'WORK SHEET'!R284","v":3793},{"$f":"'WORK SHEET'!S284","v":1528},null,null,200,null,20601,{"$f":"'WORK SHEET'!N284","v":14860},0,0,{"$f":"'WORK SHEET'!P284","v":3689},{"$f":"'WORK SHEET'!Q284","v":1486},null,null,200,null,20035,420,104,42,0,null,0,0,566]
[null,{"$f":"'WORK SHEET'!H285","v":24.824000000000002},{"$f":"'WORK SHEET'!J285","v":10},{"$f":"'WORK SHEET'!C285","v":"2010-10-01"},{"$f":"'WORK SHEET'!E285","v":"2010-10-31"},{"$f":"'WORK SHEET'!D285","v":31},{"$f":"'WORK SHEET'!O285","v":15280},{"$f":"'WORK SHEET'!T285","v":0},{"$f":"'WORK SHEET'!U285","v":0},{"$f":"'WORK SHEET'!R285","v":3793},{"$f":"'WORK SHEET'!S285","v":1528},null,null,200,null,20601,{"$f":"'WORK SHEET'!N285","v":14860},0,0,{"$f":"'WORK SHEET'!P285","v":3689},{"$f":"'WORK SHEET'!Q285","v":1486},null,null,200,null,20035,420,104,42,0,null,0,0,566]
[null,{"$f":"'WORK SHEET'!H286","v":24.824000000000002},{"$f":"'WORK SHEET'!J286","v":10},{"$f":"'WORK SHEET'!C286","v":"2010-11-01"},{"$f":"'WORK SHEET'!E286","v":"2010-11-30"},{"$f":"'WORK SHEET'!D286","v":30},{"$f":"'WORK SHEET'!O286","v":15280},{"$f":"'WORK SHEET'!T286","v":0},{"$f":"'WORK SHEET'!U286","v":0},{"$f":"'WORK SHEET'!R286","v":3793},{"$f":"'WORK SHEET'!S286","v":1528},null,null,200,null,20601,{"$f":"'WORK SHEET'!N286","v":14860},0,0,{"$f":"'WORK SHEET'!P286","v":3689},{"$f":"'WORK SHEET'!Q286","v":1486},null,null,200,null,20035,420,104,42,0,null,0,0,566]
[null,{"$f":"'WORK SHEET'!H287","v":24.824000000000002},{"$f":"'WORK SHEET'!J287","v":10},{"$f":"'WORK SHEET'!C287","v":"2010-12-01"},{"$f":"'WORK SHEET'!E287","v":"2010-12-31"},{"$f":"'WORK SHEET'!D287","v":31},{"$f":"'WORK SHEET'!O287","v":15280},{"$f":"'WORK SHEET'!T287","v":0},{"$f":"'WORK SHEET'!U287","v":0},{"$f":"'WORK SHEET'!R287","v":3793},{"$f":"'WORK SHEET'!S287","v":1528},null,null,200,null,20601,{"$f":"'WORK SHEET'!N287","v":14860},0,0,{"$f":"'WORK SHEET'!P287","v":3689},{"$f":"'WORK SHEET'!Q287","v":1486},null,null,200,null,20035,420,104,42,0,null,0,0,566]
[null,{"$f":"'WORK SHEET'!H288","v":29.96},{"$f":"'WORK SHEET'!J288","v":10},{"$f":"'WORK SHEET'!C288","v":"2011-01-01"},{"$f":"'WORK SHEET'!E288","v":"2011-01-31"},{"$f":"'WORK SHEET'!D288","v":31},{"$f":"'WORK SHEET'!O288","v":15280},{"$f":"'WORK SHEET'!T288","v":0},{"$f":"'WORK SHEET'!U288","v":0},{"$f":"'WORK SHEET'!R288","v":4578},{"$f":"'WORK SHEET'!S288","v":1528},null,null,200,null,21386,{"$f":"'WORK SHEET'!N288","v":14860},0,0,{"$f":"'WORK SHEET'!P288","v":4452},{"$f":"'WORK SHEET'!Q288","v":1486},null,null,200,null,20798,420,126,42,0,null,0,0,588]
[null,{"$f":"'WORK SHEET'!H289","v":29.96},{"$f":"'WORK SHEET'!J289","v":10},{"$f":"'WORK SHEET'!C289","v":"2011-02-01"},{"$f":"'WORK SHEET'!E289","v":"2011-02-28"},{"$f":"'WORK SHEET'!D289","v":28},{"$f":"'WORK SHEET'!O289","v":15280},{"$f":"'WORK SHEET'!T289","v":0},{"$f":"'WORK SHEET'!U289","v":0},{"$f":"'WORK SHEET'!R289","v":4578},{"$f":"'WORK SHEET'!S289","v":1528},null,null,200,null,21386,{"$f":"'WORK SHEET'!N289","v":14860},0,0,{"$f":"'WORK SHEET'!P289","v":4452},{"$f":"'WORK SHEET'!Q289","v":1486},null,null,200,null,20798,420,126,42,0,null,0,0,588]
[null,{"$f":"'WORK SHEET'!H290","v":29.96},{"$f":"'WORK SHEET'!J290","v":10},{"$f":"'WORK SHEET'!C290","v":"2011-03-01"},{"$f":"'WORK SHEET'!E290","v":"2011-03-31"},{"$f":"'WORK SHEET'!D290","v":31},{"$f":"'WORK SHEET'!O290","v":15280},{"$f":"'WORK SHEET'!T290","v":0},{"$f":"'WORK SHEET'!U290","v":0},{"$f":"'WORK SHEET'!R290","v":4578},{"$f":"'WORK SHEET'!S290","v":1528},null,null,200,null,21386,{"$f":"'WORK SHEET'!N290","v":14860},0,0,{"$f":"'WORK SHEET'!P290","v":4452},{"$f":"'WORK SHEET'!Q290","v":1486},null,null,200,null,20798,420,126,42,0,null,0,0,588]
[null,{"$f":"'WORK SHEET'!H291","v":29.96},{"$f":"'WORK SHEET'!J291","v":12},{"$f":"'WORK SHEET'!C291","v":"2011-04-01"},{"$f":"'WORK SHEET'!E291","v":"2011-04-30"},{"$f":"'WORK SHEET'!D291","v":30},{"$f":"'WORK SHEET'!O291","v":15280},{"$f":"'WORK SHEET'!T291","v":0},{"$f":"'WORK SHEET'!U291","v":0},{"$f":"'WORK SHEET'!R291","v":4578},{"$f":"'WORK SHEET'!S291","v":1834},null,null,200,null,21692,{"$f":"'WORK SHEET'!N291","v":14860},0,0,{"$f":"'WORK SHEET'!P291","v":4452},{"$f":"'WORK SHEET'!Q291","v":1783},null,null,200,null,21095,420,126,51,0,null,0,0,597]
[null,{"$f":"'WORK SHEET'!H292","v":29.96},{"$f":"'WORK SHEET'!J292","v":12},{"$f":"'WORK SHEET'!C292","v":"2011-05-01"},{"$f":"'WORK SHEET'!E292","v":"2011-05-31"},{"$f":"'WORK SHEET'!D292","v":31},{"$f":"'WORK SHEET'!O292","v":15280},{"$f":"'WORK SHEET'!T292","v":0},{"$f":"'WORK SHEET'!U292","v":0},{"$f":"'WORK SHEET'!R292","v":4578},{"$f":"'WORK SHEET'!S292","v":1834},null,null,200,null,21692,{"$f":"'WORK SHEET'!N292","v":14860},0,0,{"$f":"'WORK SHEET'!P292","v":4452},{"$f":"'WORK SHEET'!Q292","v":1783},null,null,200,null,21095,420,126,51,0,null,0,0,597]
[null,{"$f":"'WORK SHEET'!H293","v":0},{"$f":"'WORK SHEET'!J293","v":0},{"$f":"'WORK SHEET'!C293","v":"00:00:00"},{"$f":"'WORK SHEET'!E293","v":"00:00:00"},{"$f":"'WORK SHEET'!D293","v":0},{"$f":"'WORK SHEET'!O293","v":0},{"$f":"'WORK SHEET'!T293","v":0},{"$f":"'WORK SHEET'!U293","v":0},{"$f":"'WORK SHEET'!R293","v":0},{"$f":"'WORK SHEET'!S293","v":0},null,null,0,null,0,{"$f":"'WORK SHEET'!N293","v":0},0,0,{"$f":"'WORK SHEET'!P293","v":0},{"$f":"'WORK SHEET'!Q293","v":0},null,null,0,null,0,0,0,0,0,null,0,0,0]
[null,{"$f":"'WORK SHEET'!H294","v":0},{"$f":"'WORK SHEET'!J294","v":0},{"$f":"'WORK SHEET'!C294","v":"00:00:00"},{"$f":"'WORK SHEET'!E294","v":"00:00:00"},{"$f":"'WORK SHEET'!D294","v":0},{"$f":"'WORK SHEET'!O294","v":0},{"$f":"'WORK SHEET'!T294","v":0},{"$f":"'WORK SHEET'!U294","v":0},{"$f":"'WORK SHEET'!R294","v":0},{"$f":"'WORK SHEET'!S294","v":0},null,null,0,null,0,{"$f":"'WORK SHEET'!N294","v":0},0,0,{"$f":"'WORK SHEET'!P294","v":0},{"$f":"'WORK SHEET'!Q294","v":0},null,null,0,null,0,0,0,0,0,null,0,0,0]
[null,{"$f":"'WORK SHEET'!H295","v":0},{"$f":"'WORK SHEET'!J295","v":0},{"$f":"'WORK SHEET'!C295","v":"00:00:00"},{"$f":"'WORK SHEET'!E295","v":"00:00:00"},{"$f":"'WORK SHEET'!D295","v":0},{"$f":"'WORK SHEET'!O295","v":0},{"$f":"'WORK SHEET'!T295","v":0},{"$f":"'WORK SHEET'!U295","v":0},{"$f":"'WORK SHEET'!R295","v":0},{"$f":"'WORK SHEET'!S295","v":0},null,null,0,null,0,{"$f":"'WORK SHEET'!N295","v":0},0,0,{"$f":"'WORK SHEET'!P295","v":0},{"$f":"'WORK SHEET'!Q295","v":0},null,null,0,null,0,0,0,0,0,null,0,0,0]
[null,{"$f":"'WORK SHEET'!H296","v":0},{"$f":"'WORK SHEET'!J296","v":0},{"$f":"'WORK SHEET'!C296","v":"00:00:00"},{"$f":"'WORK SHEET'!E296","v":"00:00:00"},{"$f":"'WORK SHEET'!D296","v":0},{"$f":"'WORK SHEET'!O296","v":0},{"$f":"'WORK SHEET'!T296","v":0},{"$f":"'WORK SHEET'!U296","v":0},{"$f":"'WORK SHEET'!R296","v":0},{"$f":"'WORK SHEET'!S296","v":0},null,null,0,null,0,{"$f":"'WORK SHEET'!N296","v":0},0,0,{"$f":"'WORK SHEET'!P296","v":0},{"$f":"'WORK SHEET'!Q296","v":0},null,null,0,null,0,0,0,0,0,null,0,0,0]
[null,{"$f":"'WORK SHEET'!H297","v":0},{"$f":"'WORK SHEET'!J297","v":0},{"$f":"'WORK SHEET'!C297","v":"00:00:00"},{"$f":"'WORK SHEET'!E297","v":"00:00:00"},{"$f":"'WORK SHEET'!D297","v":0},{"$f":"'WORK SHEET'!O297","v":0},{"$f":"'WORK SHEET'!T297","v":0},{"$f":"'WORK SHEET'!U297","v":0},{"$f":"'WORK SHEET'!R297","v":0},{"$f":"'WORK SHEET'!S297","v":0},null,null,0,null,0,{"$f":"'WORK SHEET'!N297","v":0},0,0,{"$f":"'WORK SHEET'!P297","v":0},{"$f":"'WORK SHEET'!Q297","v":0},null,null,0,null,0,0,0,0,0,null,0,0,0]
[null,{"$f":"'WORK SHEET'!H298","v":0},{"$f":"'WORK SHEET'!J298","v":0},{"$f":"'WORK SHEET'!C298","v":"00:00:00"},{"$f":"'WORK SHEET'!E298","v":"00:00:00"},{"$f":"'WORK SHEET'!D298","v":0},{"$f":"'WORK SHEET'!O298","v":0},{"$f":"'WORK SHEET'!T298","v":0},{"$f":"'WORK SHEET'!U298","v":0},{"$f":"'WORK SHEET'!R298","v":0},{"$f":"'WORK SHEET'!S298","v":0},null,null,0,null,{"$f":"IF(OR(D26=0,DAY(D26)<>1),0,IF(DAY(#REF!)<>1,SUM(G26:M26)+SUM(#REF!),SUM(G26:M26)))","v":0},{"$f":"'WORK SHEET'!N298","v":0},0,0,{"$f":"'WORK SHEET'!P298","v":0},{"$f":"'WORK SHEET'!Q298","v":0},null,null,0,null,{"$f":"IF(OR(D26=0,DAY(D26)<>1),0,IF(DAY(#REF!)<>1,SUM(Q26:W26)+SUM(V27:W27),SUM(Q26:W26)))","v":0},0,0,0,0,null,0,0,0]
[null,null,null,null,null,null,null,null,null,null,null,null,null,null,null,null,null,null,null,null,null,null,null,null,null,null,{"$f":"SUM(AA5:AA26)","v":6720},1594,690,0,0,50,0,9004]
[null,null,null,null,null,null,null,null,null,null,null,null,null,0,null,{"$f":"IF(OR(D28=0,DAY(D28)<>1),0,IF(DAY(#REF!)<>1,SUM(G28:M28)+SUM(#REF!),SUM(G28:M28)))","v":0},null,null,null,null,null,null,null,0,null,{"$f":"IF(OR(D28=0,DAY(D28)<>1),0,IF(DAY(#REF!)<>1,SUM(Q28:W28)+SUM(V29:W29),SUM(Q28:W28)))","v":0}]
[null,null,null,"PART -III (CASH for period from 1/06/2011 to"]
[null,{"$f":"'WORK SHEET'!H312","v":29.96},{"$f":"'WORK SHEET'!J312","v":12},{"$f":"'WORK SHEET'!C312","v":"2011-06-01"},{"$f":"'WORK SHEET'!E312","v":"2011-06-30"},{"$f":"'WORK SHEET'!D312","v":30},{"$f":"'WORK SHEET'!O312","v":15280},{"$f":"'WORK SHEET'!T312","v":0},{"$f":"'WORK SHEET'!U312","v":0},{"$f":"'WORK SHEET'!R312","v":4578},{"$f":"'WORK SHEET'!S312","v":1834},null,null,200,{"$f":"ROUND('WORK SHEET'!M316*F30/VLOOKUP(MONTH(D30),'WORK SHEET'!M125:N136,2,TRUE),0)","v":0},21692,{"$f":"'WORK SHEET'!N312","v":14860},{"$f":"H30","v":0},{"$f":"I30","v":0},{"$f":"'WORK SHEET'!P312","v":4452},{"$f":"'WORK SHEET'!Q312","v":1783},null,null,200,null,21095,{"$f":"G30-Q30","v":420},{"$f":"J30-T30","v":126},51,0,null,0,{"$f":"O30-Y30","v":0},{"$f":"P30-Z30","v":597}]
[null,{"$f":"'WORK SHEET'!H313","v":29.96},{"$f":"'WORK SHEET'!J313","v":12},{"$f":"'WORK SHEET'!C313","v":"2011-07-01"},{"$f":"'WORK SHEET'!E313","v":"2011-07-30T00:14:24"},{"$f":"'WORK SHEET'!D313","v":30},15280,{"$f":"'WORK SHEET'!T313","v":0},{"$f":"'WORK SHEET'!U313","v":0},4578,1834,null,null,200,{"$f":"ROUND('WORK SHEET'!M317*F31/VLOOKUP(MONTH(D31),'WORK SHEET'!M126:N137,2,TRUE),0)","v":0},21692,{"$f":"'WORK SHEET'!N313","v":14381},{"$f":"H31","v":0},{"$f":"I31","v":0},{"$f":"'WORK SHEET'!P313","v":4309},{"$f":"'WORK SHEET'!Q313","v":1726},null,null,200,null,20416,899,269,108,0,null,0,0,597]
[null,{"$f":"'WORK SHEET'!H314","v":0},{"$f":"'WORK SHEET'!J314","v":0},{"$f":"'WORK SHEET'!C314","v":"00:00:00"},{"$f":"'WORK SHEET'!E314","v":"00:00:00"},{"$f":"'WORK SHEET'!D314","v":0},{"$f":"'WORK SHEET'!O314","v":0},{"$f":"'WORK SHEET'!T314","v":0},{"$f":"'WORK SHEET'!U314","v":0},{"$f":"'WORK SHEET'!R314","v":0},{"$f":"'WORK SHEET'!S314","v":0},null,null,0,{"$f":"ROUND('WORK SHEET'!M318*F32/VLOOKUP(MONTH(D32),'WORK SHEET'!M127:N138,2,TRUE),0)","v":{"$error":"#N/A"}},0,{"$f":"'WORK SHEET'!N314","v":0},0,0,{"$f":"'WORK SHEET'!P314","v":0},{"$f":"'WORK SHEET'!Q314","v":0},null,null,0,null,0,0,0,0,0,null,0,{"$error":"#N/A"},0]
[null,{"$f":"'WORK SHEET'!H315","v":0},{"$f":"'WORK SHEET'!J315","v":0},{"$f":"'WORK SHEET'!C315","v":"00:00:00"},{"$f":"'WORK SHEET'!E315","v":"00:00:00"},{"$f":"'WORK SHEET'!D315","v":0},{"$f":"'WORK SHEET'!O315","v":0},{"$f":"'WORK SHEET'!T315","v":0},{"$f":"'WORK SHEET'!U315","v":0},{"$f":"'WORK SHEET'!R315","v":0},{"$f":"'WORK SHEET'!S315","v":0},null,null,0,{"$f":"ROUND('WORK SHEET'!M319*F33/VLOOKUP(MONTH(D33),'WORK SHEET'!M128:N139,2,TRUE),0)","v":{"$error":"#N/A"}},0,{"$f":"'WORK SHEET'!N315","v":0},0,0,{"$f":"'WORK SHEET'!P315","v":0},{"$f":"'WORK SHEET'!Q315","v":0},null,null,0,null,0,0,0,0,0,null,0,{"$error":"#N/A"},0]
[null,{"$f":"'WORK SHEET'!H316","v":0},{"$f":"'WORK SHEET'!J316","v":0},{"$f":"'WORK SHEET'!C316","v":"00:00:00"},{"$f":"'WORK SHEET'!E316","v":"00:00:00"},{"$f":"'WORK SHEET'!D316","v":0},{"$f":"'WORK SHEET'!O316","v":0},{"$f":"'WORK SHEET'!T316","v":0},{"$f":"'WORK SHEET'!U316","v":0},{"$f":"'WORK SHEET'!R316","v":0},{"$f":"'WORK SHEET'!S316","v":0},null,null,0,{"$f":"ROUND('WORK SHEET'!M320*F34/VLOOKUP(MONTH(D34),'WORK SHEET'!M129:N140,2,TRUE),0)","v":{"$error":"#N/A"}},0,{"$f":"'WORK SHEET'!N316","v":0},0,0,{"$f":"'WORK SHEET'!P316","v":0},{"$f":"'WORK SHEET'!Q316","v":0},null,null,0,null,0,0,0,0,0,null,0,{"$error":"#N/A"},0]
[null,{"$f":"'WORK SHEET'!H317","v":0},{"$f":"'WORK SHEET'!J317","v":0},{"$f":"'WORK SHEET'!C317","v":"00:00:00"},{"$f":"'WORK SHEET'!E317","v":"00:00:00"},{"$f":"'WORK SHEET'!D317","v":0},{"$f":"'WORK SHEET'!O317","v":0},{"$f":"'WORK SHEET'!T317","v":0},{"$f":"'WORK SHEET'!U317","v":0},{"$f":"'WORK SHEET'!R317","v":0},{"$f":"'WORK SHEET'!S317","v":0},null,null,0,{"$f":"ROUND('WORK SHEET'!M321*F35/VLOOKUP(MONTH(D35),'WORK SHEET'!M130:N141,2,TRUE),0)","v":{"$error":"#N/A"}},0,{"$f":"'WORK SHEET'!N317","v":0},0,0,{"$f":"'WORK SHEET'!P317","v":0},{"$f":"'WORK SHEET'!Q317","v":0},null,null,0,null,0,0,0,0,0,null,0,{"$error":"#N/A"},0]
[null,{"$f":"'WORK SHEET'!H318","v":0},{"$f":"'WORK SHEET'!J318","v":0},{"$f":"'WORK SHEET'!C318","v":"00:00:00"},{"$f":"'WORK SHEET'!E318","v":"00:00:00"},{"$f":"'WORK SHEET'!D318","v":0},{"$f":"'WORK SHEET'!O318","v":0},{"$f":"'WORK SHEET'!T318","v":0},{"$f":"'WORK SHEET'!U318","v":0},{"$f":"'WORK SHEET'!R318","v":0},{"$f":"'WORK SHEET'!S318","v":0},null,null,0,{"$f":"ROUND('WORK SHEET'!M322*F36/VLOOKUP(MONTH(D36),'WORK SHEET'!M131:N142,2,TRUE),0)","v":{"$error":"#N/A"}},0,{"$f":"'WORK SHEET'!N318","v":0},0,0,{"$f":"'WORK SHEET'!P318","v":0},{"$f":"'WORK SHEET'!Q318","v":0},null,null,0,null,0,0,0,0,0,null,0,{"$error":"#N/A"},0]
[null,{"$f":"'WORK SHEET'!H319","v":0},{"$f":"'WORK SHEET'!J319","v":0},{"$f":"'WORK SHEET'!C319","v":"00:00:00"},{"$f":"'WORK SHEET'!E319","v":"00:00:00"},{"$f":"'WORK SHEET'!D319","v":0},{"$f":"'WORK SHEET'!O319","v":0},{"$f":"'WORK SHEET'!T319","v":0},{"$f":"'WORK SHEET'!U319","v":0},{"$f":"'WORK SHEET'!R319","v":0},{"$f":"'WORK SHEET'!S319","v":0},null,null,0,{"$f":"ROUND('WORK SHEET'!M323*F37/VLOOKUP(MONTH(D37),'WORK SHEET'!M132:N143,2,TRUE),0)","v":{"$error":"#N/A"}},{"$f":"IF(OR(D37=0,DAY(D37)<>1),0,IF(DAY(B38)<>1,SUM(G37:M37)+SUM(G38:M38),SUM(G37:M37)))","v":0},{"$f":"'WORK SHEET'!N319","v":0},0,0,{"$f":"'WORK SHEET'!P319","v":0},{"$f":"'WORK SHEET'!Q319","v":0},null,null,0,null,{"$f":"IF(OR(D37=0,DAY(D37)<>1),0,IF(DAY(B38)<>1,SUM(Q37:W37)+SUM(Q38:W38),SUM(Q37:W37)))","v":0},0,0,0,0,null,0,{"$error":"#N/A"},0]
[null,"Total for cash Adjustment (FROM 1/6/2011)",null,null,null,null,null,null,null,null,null,null,null,null,null,null,null,null,null,null,null,null,null,null,null,null,{"$f":"SUM(AA30:AA37)","v":1319},395,159,0,null,0,{"$error":"#N/A"},1194]
[null,"TOTAL",null,null,null,null,null,null,null,null,null,null,null,null,null,null,null,null,null,null,null,null,null,null,null,null,{"$f":"AA27+AA38","v":8039},{"$f":"AB27+AB38","v":1989},849,0,0,50,{"$error":"#N/A"},10198]
[null,null,null,"1) AAS benefits from 01/02/2010 to 31/05/2011is credited individual G.P.F./Z.P.P.F. A/C and arrear from the month of 06/2011 is paid in cash"]
[null,null,null,"2) Certified that amount claimed in the bill not drawn earlier."]
[null,null,null,"Note: Total=B Pay+P.P.+F.P.+D.A+H.R.A+OTHER ALWENCES",null,null,null,null,null,null,null,null,null,null,null,null,{"$f":"PROCEEDINGS!25:28","v":{"$error":"#VALUE!"}}]

{"sheet":"47-BUDGET","index":10,"n_rows":38,"n_cols":11,"rows_kept":38,"cut":false,"hidden":false,"merged":[[35,8,35,13],[37,1,37,13],[27,2,27,13],[29,2,29,13],[30,7,30,8],[31,2,31,13],[28,2,28,5],[25,2,25,13],[0,1,0,13],[8,10,8,13],[11,2,11,13],[10,5,10,7],[17,10,17,13],[18,1,18,13],[20,2,20,13],[21,2,21,13],[22,2,22,13],[23,2,23,13],[24,2,24,13]]}
[null,"BUDGET"]
[]
[null,"1.","Budget allocation for the year 2010-2011",null,null,null,null,null,null,"Rs."]
[null,"2.","Total Expenditure including this Bill",null,null,null,null,null,null,"Rs."]
[null,"3.","Balance",null,null,null,null,null,null,"Rs."]
[]
[]
[]
[null,null,null,null,null,null,null,null,null,null,"Drawing Officer"]
[]
[null,null,"This bill amount Rs.",null,null,{"$f":"'47-FRONT'!H57","v":1194}]
[null,null,{"$f":"'BILL-P.F & CASH'!A32","v":"RUPEES : ONE THOUSAND ONE HUNDRED AND NINETY FOUR  ONLY"}]
[null,null," paid by cash / cheque / draft adjust to account."]
[null,null,"Received Cash"]
[]
[]
[]
[null,null,"Drawing Officer",null,null,null,null,null,null,null,"Drawing Officer"]
[null,"REQUIRED CERTIFICATES"]
[]
[null,1,"Certified That the amount claimed in this bill has not been already drawn and paid previously."]
[null,2,"Certified that if any excess amount is paid due to the fixation the same will be recovered from the"]
[null,3,"Certified that the note of arrears claims has been carried in the respective copies office bill register ."]
[null,4,"Certified that the necessary fixation entries have been made in the service register of the individual."]
[null,5,"Certified that the pay is fixed in terms of G.O.Ms. NO.52 Finance Dept.,dated.25-02-2010"]
[null,6,"Certified that the D.A.is claimed in terms of  G.O.Ms.No.63 Finance Dept.,dated.09-03-2010"]
[null,7,"Certified that the H.R.A. is claimed in terms of G.O.Ms.No.64 Finance Dept.,dated : 09-03-2010"]
[null,8,{"$f":"CONCATENATE(\"Certified that the Special pays are claimed in terms of G.O.M.S No.118 Finance  Dept.,\")","v":"Certified that the Special pays are claimed in terms of G.O.M.S No.118 Finance  Dept.,"}]
[null,null,"dated :7/4/2010"]
[null,9,"Certified that the City Compensatory Allowance (CCA) is claimed in terms of G.O.M.S No.65 "]
[null,null,"Finance  Dept.,dated :3/9/2010"]
[null,10,{"$f":"CONCATENATE(\"Certified that the Convyance Alwance are claimed in terms of G.O.M.S No.108 Finance  Dept.,\")","v":"Certified that the Convyance Alwance are claimed in terms of G.O.M.S No.108 Finance  Dept.,"}]
[null,null,"dated :7/04/2010"]
[]
[]
[null,null,null,null,null,null,null,null,"DRAWING OFFICER"]
[]
[null,"For the use Of  Accountant  General  Office"]

{"sheet":"P.F SCHEDULE","index":11,"n_rows":33,"n_cols":10,"rows_kept":33,"cut":false,"hidden":false,"merged":[[4,0,4,9],[9,1,9,3],[6,4,7,4],[5,5,5,7],[5,2,5,4],[32,7,32,9],[23,0,23,9],[25,0,26,0],[25,1,26,1],[25,2,26,3],[30,0,30,9],[25,9,26,9],[24,5,24,7],[24,2,24,4],[25,4,26,4],[25,5,26,5],[25,6,26,6],[25,7,25,8],[27,2,27,3],[28,1,28,3],[11,0,11,9],[13,7,13,9],[8,2,8,3],[6,5,7,5],[6,6,7,6],[6,7,6,8],[6,9,7,9],[6,0,7,0],[6,1,7,1],[6,2,7,3]]}
[null,{"$f":"CONCATENATE(\"D.D.O. CODE :  \",'P. TOKEN'!B7)","v":"D.D.O. CODE :  07050308026"},null,null,null,null,"Trans ID No. :"]
[null,null,null,null,null,null,"               Date :"]
[]
[]
[{"$f":"CONCATENATE(\"SCHEDULE SHOWING THE AAS ARREARS CREDITED TO                                                              Z.P.P.F. / G.P.F.  FROM   01-02-10  TO  31-05-2011  (16MONTHS)  OF\",\"                                                                          \",PROCEEDINGS!C41,)","v":"SCHEDULE SHOWING THE AAS ARREARS CREDITED TO                                                              Z.P.P.F. / G.P.F.  FROM   01-02-10  TO  31-05-2011  (16MONTHS)  OF                                                                          SK.KHAJARAHAMTULLA, S.G.T., MPPS(G), POTLAPADU"}]
[null,null,"IN THE MONTH OF",null,null,{"$f":"'WORK SHEET'!E62","v":"2009-08-06"}]
["Sl.No","Name of the Subscriber","Designation",null,"Employee Code","P.F.No","PRC ARREAR CREDITED TO P.F.","Refunds or with Drawls",null,"Total Amount released"]
[null,null,null,null,null,null,null,"Amount","No. of inst"]
[1,{"$f":"'WORK SHEET'!E2","v":"SK.KHAJARAHAMTULLA"},{"$f":"PROCEEDINGS!G19","v":"S.G.T."},null,{"$f":"'WORK SHEET'!E7","v":724731},{"$f":"'WORK SHEET'!E10","v":17396},{"$f":"BILL!AH27","v":9004},{"$f":"[2]BILL!AE71","v":" "},null,{"$f":"SUM(G9:I9)","v":9004}]
[null,"TOTAL",null,null,null,null,{"$f":"G9","v":9004},null,null,{"$f":"J9","v":9004}]
[]
[{"$f":"'WORK SHEET'!AJ149","v":"RUPEES : NINE  THOUSAND AND FOUR  ONLY"}]
[]
[null,null,null,null,null,null,null,"D.D.O. SIGN"]
[]
[]
[]
[]
[]
[null,{"$f":"CONCATENATE(\"D.D.O. CODE :  \",'P. TOKEN'!B7)","v":"D.D.O. CODE :  07050308026"},null,null,null,null,"Trans ID No. :"]
[null,null,null,null,null,null,"               Date :"]
[]
[]
[{"$f":"A5","v":"SCHEDULE SHOWING THE AAS ARREARS CREDITED TO                                                              Z.P.P.F. / G.P.F.  FROM   01-02-10  TO  31-05-2011  (16MONTHS)  OF                                                                          SK.KHAJARAHAMTULLA, S.G.T., MPPS(G), POTLAPADU"}]
[null,null,"IN THE MONTH OF",null,null,{"$f":"F6","v":"2009-08-06"}]
["Sl.No","Name of the Subscriber","Designation",null,"Employee Code","P.F.No","PRC ARREAR CREDITED TO P.F.","refunds or with Drawls",null,"Total Amount released"]
[null,null,null,null,null,null,null,"Amount","No. of inst"]
[1,{"$f":"B9","v":"SK.KHAJARAHAMTULLA"},{"$f":"C9","v":"S.G.T."},null,{"$f":"E9","v":724731},{"$f":"F9","v":17396},{"$f":"G9","v":9004},null,null,{"$f":"SUM(G28:I28)","v":9004}]
[null,"TOTAL",null,null,null,null,{"$f":"G28","v":9004},null,null,{"$f":"J28","v":9004}]
[]
[{"$f":"A12","v":"RUPEES : NINE  THOUSAND AND FOUR  ONLY"}]
[]
[null,null,null,null,null,null,null,"D.D.O. SIGN"]

{"sheet":"PT SCHEDULE","index":12,"n_rows":32,"n_cols":10,"rows_kept":32,"cut":false,"hidden":false,"merged":[[0,0,0,9],[3,0,3,9],[1,0,1,9],[43,5,43,9],[2,0,2,3],[2,4,2,5],[4,0,4,9],[31,0,31,9],[36,5,36,9]]}
["STATEMENT SHOWING THE SCHEDULE RECOVERY OF PROFESSIONAL TAX IN PRC 2010 BILL OF "]
[{"$f":"CONCATENATE('WORK SHEET'!E2,\" \",'WORK SHEET'!E3,\" \",'WORK SHEET'!E4,\" FOR THE MONTH OF\")","v":"SK.KHAJARAHAMTULLA MPPS(G) POTLAPADU FOR THE MONTH OF"}]
["from 1-02-10 to ",null,null,null,{"$f":"'WORK SHEET'!E135","v":"2011-07-30T00:14:24"}]
["Head of Account: \"0028 Other Taxes on income & Expenditure MR.. 107 Taxes on profession"]
["Trades Calling and Employment S.H.01 Receipt (from) four professions                                                    Trades Calling and Employment\""]
["Sl.No.","Employee Code","Name of the Employee & Degn","MONTH","NEW GROSS","NEW P.T.","OLD GROSS","OLD P.T.","Amount of Recovery","Remarks"]
[1,{"$f":"'WORK SHEET'!E7","v":724731},{"$f":"'WORK SHEET'!E2","v":"SK.KHAJARAHAMTULLA"},{"$f":"IF('WORK SHEET'!BP79=0,\" \",'WORK SHEET'!BP79)","v":"2010-02-01"},{"$f":"IF('WORK SHEET'!BW79=0,\" \",'WORK SHEET'!BW79)","v":18233},{"$f":"IF('WORK SHEET'!BX79=0,\" \",'WORK SHEET'!BX79)","v":150},{"$f":"IF('WORK SHEET'!BY79=0,\" \",'WORK SHEET'!BY79)","v":18763},{"$f":"IF('WORK SHEET'!BZ79=0,\" \",'WORK SHEET'!BZ79)","v":150},{"$f":"IF(F7=\" \",\" \",F7-H7)","v":0}]
[null,null,{"$f":"PROCEEDINGS!H19","v":0},{"$f":"IF('WORK SHEET'!BP80=0,\" \",'WORK SHEET'!BP80)","v":"2010-03-01"},{"$f":"IF('WORK SHEET'!BW80=0,\" \",'WORK SHEET'!BW80)","v":18233},{"$f":"IF('WORK SHEET'!BX80=0,\" \",'WORK SHEET'!BX80)","v":150},{"$f":"IF('WORK SHEET'!BY80=0,\" \",'WORK SHEET'!BY80)","v":18763},{"$f":"IF('WORK SHEET'!BZ80=0,\" \",'WORK SHEET'!BZ80)","v":150},{"$f":"IF(F8=\" \",\" \",F8-H8)","v":0}]
[null,null,null,{"$f":"IF('WORK SHEET'!BP81=0,\" \",'WORK SHEET'!BP81)","v":"2010-04-01"},{"$f":"IF('WORK SHEET'!BW81=0,\" \",'WORK SHEET'!BW81)","v":18233},{"$f":"IF('WORK SHEET'!BX81=0,\" \",'WORK SHEET'!BX81)","v":150},{"$f":"IF('WORK SHEET'!BY81=0,\" \",'WORK SHEET'!BY81)","v":18763},{"$f":"IF('WORK SHEET'!BZ81=0,\" \",'WORK SHEET'!BZ81)","v":150},0]
[null,null,null,{"$f":"IF('WORK SHEET'!BP82=0,\" \",'WORK SHEET'!BP82)","v":"2010-05-01"},{"$f":"IF('WORK SHEET'!BW82=0,\" \",'WORK SHEET'!BW82)","v":18233},{"$f":"IF('WORK SHEET'!BX82=0,\" \",'WORK SHEET'!BX82)","v":150},{"$f":"IF('WORK SHEET'!BY82=0,\" \",'WORK SHEET'!BY82)","v":18763},{"$f":"IF('WORK SHEET'!BZ82=0,\" \",'WORK SHEET'!BZ82)","v":150},0]
[null,null,null,{"$f":"IF('WORK SHEET'!BP83=0,\" \",'WORK SHEET'!BP83)","v":"2010-06-01"},{"$f":"IF('WORK SHEET'!BW83=0,\" \",'WORK SHEET'!BW83)","v":18233},{"$f":"IF('WORK SHEET'!BX83=0,\" \",'WORK SHEET'!BX83)","v":150},{"$f":"IF('WORK SHEET'!BY83=0,\" \",'WORK SHEET'!BY83)","v":18763},{"$f":"IF('WORK SHEET'!BZ83=0,\" \",'WORK SHEET'!BZ83)","v":150},0]
[null,null,null,{"$f":"IF('WORK SHEET'!BP84=0,\" \",'WORK SHEET'!BP84)","v":"2010-07-01"},{"$f":"IF('WORK SHEET'!BW84=0,\" \",'WORK SHEET'!BW84)","v":19469},{"$f":"IF('WORK SHEET'!BX84=0,\" \",'WORK SHEET'!BX84)","v":150},{"$f":"IF('WORK SHEET'!BY84=0,\" \",'WORK SHEET'!BY84)","v":20035},{"$f":"IF('WORK SHEET'!BZ84=0,\" \",'WORK SHEET'!BZ84)","v":200},-50]
[null,null,null,{"$f":"IF('WORK SHEET'!BP85=0,\" \",'WORK SHEET'!BP85)","v":"2010-08-01"},{"$f":"IF('WORK SHEET'!BW85=0,\" \",'WORK SHEET'!BW85)","v":20035},{"$f":"IF('WORK SHEET'!BX85=0,\" \",'WORK SHEET'!BX85)","v":200},{"$f":"IF('WORK SHEET'!BY85=0,\" \",'WORK SHEET'!BY85)","v":20601},{"$f":"IF('WORK SHEET'!BZ85=0,\" \",'WORK SHEET'!BZ85)","v":200},0]
[null,null,null,{"$f":"IF('WORK SHEET'!BP86=0,\" \",'WORK SHEET'!BP86)","v":"2010-09-01"},{"$f":"IF('WORK SHEET'!BW86=0,\" \",'WORK SHEET'!BW86)","v":20035},{"$f":"IF('WORK SHEET'!BX86=0,\" \",'WORK SHEET'!BX86)","v":200},{"$f":"IF('WORK SHEET'!BY86=0,\" \",'WORK SHEET'!BY86)","v":20601},{"$f":"IF('WORK SHEET'!BZ86=0,\" \",'WORK SHEET'!BZ86)","v":200},0]
[null,null,null,{"$f":"IF('WORK SHEET'!BP87=0,\" \",'WORK SHEET'!BP87)","v":"2010-10-01"},{"$f":"IF('WORK SHEET'!BW87=0,\" \",'WORK SHEET'!BW87)","v":20035},{"$f":"IF('WORK SHEET'!BX87=0,\" \",'WORK SHEET'!BX87)","v":200},{"$f":"IF('WORK SHEET'!BY87=0,\" \",'WORK SHEET'!BY87)","v":20601},{"$f":"IF('WORK SHEET'!BZ87=0,\" \",'WORK SHEET'!BZ87)","v":200},0]
[null,null,null,{"$f":"IF('WORK SHEET'!BP88=0,\" \",'WORK SHEET'!BP88)","v":"2010-11-01"},{"$f":"IF('WORK SHEET'!BW88=0,\" \",'WORK SHEET'!BW88)","v":20035},{"$f":"IF('WORK SHEET'!BX88=0,\" \",'WORK SHEET'!BX88)","v":200},{"$f":"IF('WORK SHEET'!BY88=0,\" \",'WORK SHEET'!BY88)","v":20601},{"$f":"IF('WORK SHEET'!BZ88=0,\" \",'WORK SHEET'!BZ88)","v":200},0]
[null,null,null,{"$f":"IF('WORK SHEET'!BP89=0,\" \",'WORK SHEET'!BP89)","v":"2010-12-01"},{"$f":"IF('WORK SHEET'!BW89=0,\" \",'WORK SHEET'!BW89)","v":20035},{"$f":"IF('WORK SHEET'!BX89=0,\" \",'WORK SHEET'!BX89)","v":200},{"$f":"IF('WORK SHEET'!BY89=0,\" \",'WORK SHEET'!BY89)","v":20601},{"$f":"IF('WORK SHEET'!BZ89=0,\" \",'WORK SHEET'!BZ89)","v":200},0]
[null,null,null,{"$f":"IF('WORK SHEET'!BP90=0,\" \",'WORK SHEET'!BP90)","v":"2011-01-01"},{"$f":"IF('WORK SHEET'!BW90=0,\" \",'WORK SHEET'!BW90)","v":20798},{"$f":"IF('WORK SHEET'!BX90=0,\" \",'WORK SHEET'!BX90)","v":200},{"$f":"IF('WORK SHEET'!BY90=0,\" \",'WORK SHEET'!BY90)","v":21386},{"$f":"IF('WORK SHEET'!BZ90=0,\" \",'WORK SHEET'!BZ90)","v":200},0]
[null,null,null,{"$f":"IF('WORK SHEET'!BP91=0,\" \",'WORK SHEET'!BP91)","v":"2011-02-01"},{"$f":"IF('WORK SHEET'!BW91=0,\" \",'WORK SHEET'!BW91)","v":20798},{"$f":"IF('WORK SHEET'!BX91=0,\" \",'WORK SHEET'!BX91)","v":200},{"$f":"IF('WORK SHEET'!BY91=0,\" \",'WORK SHEET'!BY91)","v":21386},{"$f":"IF('WORK SHEET'!BZ91=0,\" \",'WORK SHEET'!BZ91)","v":200},0]
[null,null,null,{"$f":"IF('WORK SHEET'!BP92=0,\" \",'WORK SHEET'!BP92)","v":"2011-03-01"},{"$f":"IF('WORK SHEET'!BW92=0,\" \",'WORK SHEET'!BW92)","v":20798},{"$f":"IF('WORK SHEET'!BX92=0,\" \",'WORK SHEET'!BX92)","v":200},{"$f":"IF('WORK SHEET'!BY92=0,\" \",'WORK SHEET'!BY92)","v":21386},{"$f":"IF('WORK SHEET'!BZ92=0,\" \",'WORK SHEET'!BZ92)","v":200},0]
[null,null,null,{"$f":"IF('WORK SHEET'!BP93=0,\" \",'WORK SHEET'!BP93)","v":"2011-04-01"},{"$f":"IF('WORK SHEET'!BW93=0,\" \",'WORK SHEET'!BW93)","v":21095},{"$f":"IF('WORK SHEET'!BX93=0,\" \",'WORK SHEET'!BX93)","v":200},{"$f":"IF('WORK SHEET'!BY93=0,\" \",'WORK SHEET'!BY93)","v":21692},{"$f":"IF('WORK SHEET'!BZ93=0,\" \",'WORK SHEET'!BZ93)","v":200},0]
[null,null,null,{"$f":"IF('WORK SHEET'!BP94=0,\" \",'WORK SHEET'!BP94)","v":"2011-05-01"},{"$f":"IF('WORK SHEET'!BW94=0,\" \",'WORK SHEET'!BW94)","v":21095},{"$f":"IF('WORK SHEET'!BX94=0,\" \",'WORK SHEET'!BX94)","v":200},{"$f":"IF('WORK SHEET'!BY94=0,\" \",'WORK SHEET'!BY94)","v":21692},{"$f":"IF('WORK SHEET'!BZ94=0,\" \",'WORK SHEET'!BZ94)","v":200},0]
[null,null,null,{"$f":"IF('WORK SHEET'!BP95=0,\" \",'WORK SHEET'!BP95)","v":"2011-06-01"},{"$f":"IF('WORK SHEET'!BW95=0,\" \",'WORK SHEET'!BW95)","v":21095},{"$f":"IF('WORK SHEET'!BX95=0,\" \",'WORK SHEET'!BX95)","v":200},{"$f":"IF('WORK SHEET'!BY95=0,\" \",'WORK SHEET'!BY95)","v":21692},{"$f":"IF('WORK SHEET'!BZ95=0,\" \",'WORK SHEET'!BZ95)","v":200},0]
[null,null,null,{"$f":"IF('WORK SHEET'!BP96=0,\" \",'WORK SHEET'!BP96)","v":"2011-07-01"},{"$f":"IF('WORK SHEET'!BW96=0,\" \",'WORK SHEET'!BW96)","v":20416},{"$f":"IF('WORK SHEET'!BX96=0,\" \",'WORK SHEET'!BX96)","v":200},{"$f":"IF('WORK SHEET'!BY96=0,\" \",'WORK SHEET'!BY96)","v":21692},{"$f":"IF('WORK SHEET'!BZ96=0,\" \",'WORK SHEET'!BZ96)","v":200},0]
[null,null,null,{"$f":"IF('WORK SHEET'!BP97=0,\" \",'WORK SHEET'!BP97)","v":" "},{"$f":"IF('WORK SHEET'!BW97=0,\" \",'WORK SHEET'!BW97)","v":" "},{"$f":"IF('WORK SHEET'!BX97=0,\" \",'WORK SHEET'!BX97)","v":" "},{"$f":"IF('WORK SHEET'!BY97=0,\" \",'WORK SHEET'!BY97)","v":" "},{"$f":"IF('WORK SHEET'!BZ97=0,\" \",'WORK SHEET'!BZ97)","v":" "}," "]
[null,null,null,{"$f":"IF('WORK SHEET'!BP98=0,\" \",'WORK SHEET'!BP98)","v":" "},{"$f":"IF('WORK SHEET'!BW98=0,\" \",'WORK SHEET'!BW98)","v":" "},{"$f":"IF('WORK SHEET'!BX98=0,\" \",'WORK SHEET'!BX98)","v":" "},{"$f":"IF('WORK SHEET'!BY98=0,\" \",'WORK SHEET'!BY98)","v":" "},{"$f":"IF('WORK SHEET'!BZ98=0,\" \",'WORK SHEET'!BZ98)","v":" "}," "]
[null,null,null,{"$f":"IF('WORK SHEET'!BP99=0,\" \",'WORK SHEET'!BP99)","v":" "},{"$f":"IF('WORK SHEET'!BW99=0,\" \",'WORK SHEET'!BW99)","v":" "},{"$f":"IF('WORK SHEET'!BX99=0,\" \",'WORK SHEET'!BX99)","v":" "},{"$f":"IF('WORK SHEET'!BY99=0,\" \",'WORK SHEET'!BY99)","v":" "},{"$f":"IF('WORK SHEET'!BZ99=0,\" \",'WORK SHEET'!BZ99)","v":" "}," "]
[null,null,null,{"$f":"IF('WORK SHEET'!BP100=0,\" \",'WORK SHEET'!BP100)","v":" "},{"$f":"IF('WORK SHEET'!BW100=0,\" \",'WORK SHEET'!BW100)","v":" "},{"$f":"IF('WORK SHEET'!BX100=0,\" \",'WORK SHEET'!BX100)","v":" "},{"$f":"IF('WORK SHEET'!BY100=0,\" \",'WORK SHEET'!BY100)","v":" "},{"$f":"IF('WORK SHEET'!BZ100=0,\" \",'WORK SHEET'!BZ100)","v":" "}," "]
[null,null,null,{"$f":"IF('WORK SHEET'!BP101=0,\" \",'WORK SHEET'!BP101)","v":" "},{"$f":"IF('WORK SHEET'!BW101=0,\" \",'WORK SHEET'!BW101)","v":" "},{"$f":"IF('WORK SHEET'!BX101=0,\" \",'WORK SHEET'!BX101)","v":" "},{"$f":"IF('WORK SHEET'!BY101=0,\" \",'WORK SHEET'!BY101)","v":" "},{"$f":"IF('WORK SHEET'!BZ101=0,\" \",'WORK SHEET'!BZ101)","v":" "}," "]
[null,null,"TOTAL",null,null,null,null,null,{"$f":"SUM(I7:I29)","v":-50}]
[]
[{"$f":"'WORK SHEET'!AJ155","v":{"$error":"#N/A"}}]

{"sheet":"49-(1P)","index":13,"n_rows":18,"n_cols":14,"rows_kept":18,"cut":false,"hidden":false,"merged":[[0,0,0,13],[1,0,1,13],[2,0,2,13],[4,0,4,13],[5,13,6,13],[5,7,5,8],[5,0,6,0],[5,12,6,12],[5,4,6,4],[5,9,6,9],[5,5,5,6],[5,11,6,11],[16,9,16,12],[5,1,6,1],[5,2,6,2],[5,3,6,3],[5,10,6,10],[12,11,12,12],[12,4,12,10],[15,9,15,12]]}
["A.P.T.C. FORM - 49"]
["(See subsidiary Rule 13 under Treasury Rule 10)"]
["PERIODICAL INCREMENT CERTIFICATE"]
["ANNEXURE"]
["(1) Certified that every Government Servant (s) named below has have been earned and prescribed periodical increment from date / dates noted in column (10) and either I(a) has / have been the incumbent or the appointment indicated against his name / their names for a period not less than _____years since the date in column (5) or (if he has / they have been suspended for misconduct) column (7) after deducting the periods between the dates showing in columns (3) and has (9) and has been subjected in any order of stoppage of increment as panaulty during the periods and during the periods of leave on average pay taken at a time from _____________ to ______________ and from _____________ to _______________ which has / have been counted for increments / in the case of officiating Government servents / Servents named below the / they would have officiated in the post / posts but for his / thier going on leave or __________"]
["sno","Name","Appointment","Whether substantive or officiating","Date from which present pay is drawn","Suspension for misconduct",null,"Leave without pay and in the case of those holding the post temporarily or in an officiating capacity all kinds of leave other than leave on average pay during which they would have continued to officiate in the post but for their going on leave upto a maximum of four months of such leave taken at time.",null,"Date from which increment may be given ","Scale of pay ","Present pay","Amount of increment","Future pay"]
[null,null,null,null,null,"From","To","From","To"]
[1,2,3,4,5,6,7,8,9,10,11,12,13,14]
[null,null,null,null,null,null,null,null,null,{"$f":"'WORK SHEET'!F108","v":"2010-02-01"},{"$f":"'WORK SHEET'!L108","v":"14860-39540"},{"$f":"'WORK SHEET'!I108","v":14440},{"$f":"N9-L9","v":420},{"$f":"'WORK SHEET'!H108","v":14860}]
[1,{"$f":"CONCATENATE('WORK SHEET'!E2,\" \",'WORK SHEET'!E54)","v":"SK.KHAJARAHAMTULLA "},null,null,null,null,null,null,null,{"$f":"PROCEEDINGS!B33","v":"2010-08-01"},{"$f":"PROCEEDINGS!F33","v":"14860-39540"},{"$f":"PROCEEDINGS!D33","v":14860},{"$f":"N10-L10","v":420},{"$f":"PROCEEDINGS!E33","v":15280}]
[null,{"$f":"'WORK SHEET'!E3","v":"MPPS(G)"},null,null,null,null,null,null,null,{"$f":"PROCEEDINGS!B34","v":" "},{"$f":"PROCEEDINGS!F34","v":" "},{"$f":"PROCEEDINGS!D34","v":" "},{"$f":"IF(L11=\" \",\" \",N11-L11)","v":" "},{"$f":"PROCEEDINGS!E34","v":" "}]
[null,{"$f":"'WORK SHEET'!E4","v":"POTLAPADU"},null,null,null,null,null,null,null,{"$f":"PROCEEDINGS!B35","v":" "},{"$f":"PROCEEDINGS!F35","v":" "},{"$f":"PROCEEDINGS!D35","v":" "},{"$f":"IF(J12=\" \",\" \",N12-L12)","v":" "},{"$f":"PROCEEDINGS!E35","v":" "}]
[null,{"$f":"CONCATENATE('WORK SHEET'!E5,\" \",\"MANDAL\")","v":"KURICHEDU MANDAL"},null,null,{"$f":"CONCATENATE(PROCEEDINGS!H33,PROCEEDINGS!H34)","v":"  "},null,null,null,null,null,null,{"$f":"PROCEEDINGS!H35","v":" "}]
[]
[]
[null,null,null,null,null,null,null,null,null,{"$f":"PROCEEDINGS!H40","v":"MANDAL EDUCATIONAL OFFICER"}]
[null,null,null,null,null,null,null,null,null,{"$f":"PROCEEDINGS!H41","v":"MANDAL PARASAD "}]
[null,null,null,null,null,null,null,null,null,null,{"$f":"PROCEEDINGS!H42","v":"KURICHEDU"}]

{"sheet":"49-(2P)","index":14,"n_rows":20,"n_cols":11,"rows_kept":20,"cut":false,"hidden":false,"merged":[[0,1,0,12],[3,0,3,13],[5,0,5,13],[13,5,13,12]]}
["Note :","1. When an increment claimed operates to carry Government Servant over an efficiancy hav ethe claim should be supported by a declaration from the competent authority that it has satisfied itself that the character and efficiency of the Government Servant concerned are such that he is fit to pass the above column (5) and (10) to (14) should be filled up in red ink. 2. The terms leave on average pay upto a maximum of 4 months where ever occuring from includes earned leave upto a maximum of 100 days or 50 days or 30 days in case may be for a Government Servants governed by the Andhra Pradesh Leave Rules, 1988 are concerned.  3. The service of the individuals satisfactor and no disciplinary cases are pending against during the period of increment. "]
[]
[]
["CERTIFICATE"]
[]
["(As laid down in Government Memo No.104215 A/1620/Pen.11/56-1, Dated 10-1-1977)"]
[]
[null,null,"Certified that Sri ",{"$f":"PREAMBLE!D3","v":"SK.KHAJARAHAMTULLA, , MPPS(G), POTLAPADU, KURICHEDU MANDAL"}]
["whose basic pay is Rs.",null,{"$f":"MAX('49-(1P)'!N9:N12)","v":15280},"has already insured under policy No.",null,null,null,{"$f":"'WORK SHEET'!E11","v":"L2107590"},null,"of the Director of Insurances, AP, Hyd"]
["or its Regional Office and monthly premium of Rs.",null,null,null,{"$f":"'WORK SHEET'!E12","v":450},"is being deducted from his salary in accordance with the Rules of compalsory insurance"]
["them applicable to AP State Employees and sum of Rs.______________ towards of monthly premium is paid in challan No._________ dated ________"]
["towards of compulsory insurance scheme applicable to Govt. Servants as per G.O.Ms.No.337 F & P dated 3-8-1976."]
[]
[null,null,"       Certified that the age of Sri",null,null,{"$f":"IF('WORK SHEET'!E121=1,PROCEEDINGS!H18,\" \")","v":" "}]
["has exceeded 45 years and hence he can not insure the life with Government Life Insurance Department."]
[]
[]
[null,null,null,null,null,null,null,null,null,null,{"$f":"'49-(1P)'!J16","v":"MANDAL EDUCATIONAL OFFICER"}]
[null,null,null,null,null,null,null,null,null,null,{"$f":"'49-(1P)'!J17","v":"MANDAL PARASAD "}]
[null,null,null,null,null,null,null,null,null,null,{"$f":"'49-(1P)'!K18","v":"KURICHEDU"}]

{"sheet":"PREAMBLE","index":15,"n_rows":28,"n_cols":15,"rows_kept":28,"cut":false,"hidden":true,"merged":[[0,0,0,15],[9,0,9,15],[16,0,16,5],[16,6,16,15]]}
["PREAMBLE"]
[]
[null,null,"Sri/Smt./Kum.",{"$f":"CONCATENATE('WORK SHEET'!E2,\", \",'WORK SHEET'!E54,\", \",'WORK SHEET'!E3,\", \",'WORK SHEET'!E4,\", \",'WORK SHEET'!E5,\" \",\"MANDAL\",)","v":"SK.KHAJARAHAMTULLA, , MPPS(G), POTLAPADU, KURICHEDU MANDAL"}]
["is opted to come under revised pay scales, 2010 with effect from",null,null,null,null,null,null,{"$f":"#REF!","v":{"$error":"#REF!"}},{"$f":"#REF!","v":{"$error":"#REF!"}},null,null,{"$f":"CONCATENATE(\"He/She was drawning existing pay\")","v":"He/She was drawning existing pay"}]
[{"$f":"CONCATENATE(\"Rs.\",#REF!)","v":{"$error":"#REF!"}},null,{"$f":"CONCATENATE(\"in the time scale of \",#REF!,CONCATENATE(\" in the cadre of \",#REF!,\" his/her pay fixed at Rs.\",#REF!,\" in the time scale of \",#REF!))","v":{"$error":"#REF!"}}]
[{"$f":"CONCATENATE(\"and released periodical increments raising pay from Rs.\",#REF!,\" to \",#REF!,#REF!,\" in the time scale\", PROCEEDINGS!#REF!,\" with effect from\")","v":{"$error":"#REF!"}},null,null,null,null,null,null,null,null,null,null,null,null,{"$f":"PROCEEDINGS!#REF!","v":{"$error":"#REF!"}}]
[{"$f":"CONCATENATE(\"and released periodical increments raising pay from Rs.\",#REF!,\" to \",#REF!,#REF!,\" in the time scale\", PROCEEDINGS!#REF!,\" with effect from\")","v":{"$error":"#REF!"}},null,null,null,null,null,null,null,null,null,null,null,null,{"$f":"PROCEEDINGS!#REF!","v":{"$error":"#REF!"}}]
[{"$f":"CONCATENATE(\"and released periodical increments raising pay from Rs.\",#REF!,#REF!,\" to \",#REF!,\" in the time scale\", PROCEEDINGS!#REF!,\" with effect from\")","v":{"$error":"#REF!"}},null,null,null,null,null,null,null,null,null,null,null,null,{"$f":"PROCEEDINGS!#REF!","v":{"$error":"#REF!"}}]
[{"$f":"'49-(1P)'!K13","v":0},null,null,null,null,null,{"$f":"'49-(1P)'!L13","v":" "},{"$f":"IF('WORK SHEET'!D80=9,CONCATENATE(\", as he promoted to \",'WORK SHEET'!E44,\" \",\"on \"),\" \")","v":" "},null,null,null,null,{"$f":"IF(H9=\" \",\" \",'WORK SHEET'!E138)","v":" "}]
[]
[]
["                  The difference of pay and allowances from 01-07-2008 to 31-013-2010 are adjusted to notional. The fixation arrears for the period from "]
["1-2-2010 to 28-2-2010 adjested to p.f. as per G.O.Ms.No.52 Finanace (PC-I) Department dated 25-02-2010."]
["in the revised pay scales 2010 from 01-03-2010 onwards will be paid in cash accordingly drawn as follows vide Proceedings "]
[{"$f":"CONCATENATE(\" Rc.No.\",PROCEEDINGS!C4,\" dated \")","v":" Rc.No.2/AAS/2011 dated "},null,null,{"$f":"'WORK SHEET'!E15","v":"2011-08-01"},{"$f":"CONCATENATE(\"of the \",K26,\", \",K27,\",\",K28)","v":"of the MANDAL EDUCATIONAL OFFICER, MANDAL PARASAD ,KURICHEDU"}]
[]
["Existing Pay Scale",null,null,null,null,null,"Revised Pay scales, 2010"]
[]
["1.","01-07-2008 to 31-12-2008",null,null,42.39,"%",null,"1.","01-07-2008 to 31-12-2008",null,null,null,null,"--nil--"]
["2.","01-01-2009 to 30-06-2009",null,null,51.81,"%",null,"2.","01-01-2009 to 30-06-2009",null,null,null,null,5.1360000000000001,"%"]
["3.","01-07-2009 to 31-12-2009",null,null,60.287999999999997,"%",null,"3.","01-07-2009 to 31-12-2009",null,null,null,null,9.4160000000000004,"%"]
[]
[]
[]
[]
[null,null,null,null,null,null,null,null,null,null,{"$f":"'49-(1P)'!J16","v":"MANDAL EDUCATIONAL OFFICER"}]
[null,null,null,null,null,null,null,null,null,null,{"$f":"'49-(1P)'!J17","v":"MANDAL PARASAD "}]
[null,null,null,null,null,null,null,null,null,null,{"$f":"'49-(1P)'!K18","v":"KURICHEDU"}]

{"sheet":"Sheet1","index":16,"n_rows":0,"n_cols":0,"rows_kept":0,"cut":false,"hidden":false,"merged":[]}

{"sheet":"Sheet2","index":17,"n_rows":0,"n_cols":0,"rows_kept":0,"cut":false,"hidden":false,"merged":[]}

{"sheet":"Sheet3","index":18,"n_rows":0,"n_cols":0,"rows_kept":0,"cut":false,"hidden":false,"merged":[]}